{"text_format":"1","workbook":"xlsx","n_sheets":6,"sheets":["Introduction & Instructions","Flight Calculation Sheet","Dashboard","Emission Factors","Lists","Airports"],"not_rendered":{"charts":2,"images":1,"macros":1,"external_links":0,"defined_names":0,"comments":0,"pivot_tables":2},"unopened":[],"bounds":{"document_bytes":16777216,"sheet_cells":100000,"rows_first":2000,"rows_last":500,"rows_between":2000,"halvings":0,"cell_chars":16384,"cell_head_chars":4096},"cells_cut":0,"cells_raw":0,"read":"whole","date_system":"1900"}

{"sheet":"Introduction & Instructions","index":0,"n_rows":21,"n_cols":3,"rows_kept":21,"cut":false,"hidden":false,"merged":[[3,0,17,0],[3,2,17,2]]}
["FLIGHT DISTANCE EMISSIONS CALCULATOR"]
[]
["PURPOSE",null,"HOW TO USE THIS WORKBOOK"]
["This Excel workbook is designed to help organisations quickly calculate the emissions associated with business flights.\n\nIt takes an origin and a destination as inputs for each flight, as well as the class travelled and number of passengers, and automatically calculates the distance in kilometers between the origin and destination. The class is then used to determine the appropriate emissions factor to use from the 2024 DEFRA conversion factor database published by the UK Government, the de-facto standard database used worldwide for flight emission calculations. You can view the source of the emission factors by following the Factor Source Links in the Emission Factors sheet.\n\nThe calculations in this workbook can be used to fulfil the reporting requirements for Scope 3 Category 6: Business Travel, under many reporting frameworks worldwide (AASB S2, IFRS S2, CA SB 253, CSRD).\n",null,"1. Download your business flights data from your company's expense or travel management system, ensuring that the data includes origin and destination data.\n2. Remove the example flights in the Flight Calculation Sheet workbook.\n3. This workbook accepts origins and destinations in 2 forms: IATA codes (eg. SYD for Sydney Airport), or city names (eg. Sydney for Sydney Airport). City names will only match if there is a major international airport in the city.\n4. Download class of travel from your systems too, if available. If it's not, choose Average as the value for class to use the average emission factor value.\n5. If number of passengers per booking is available, make sure this is also included, as number of passengers is a required value. If you are unsure, or each row is a single passenger, just put 1 into the Num Passengers cell.\n6. With origin, destination, class and number of passengers filled in, the workbook will automatically calculate the distance and associated emissions and output them in the output columns from Columns E-N. If it was unable to find a matching airport, an error will show. You can also optionally include a value in the Return? column to specify return flights in the calculation.\n7. Use the Dashboard sheet to view emissions by class and top 10 routes by emissions. Make sure you refresh the pivot charts whenever you change any of the data in the workbook."]
[]
[]
[]
[]
[]
[]
[]
[]
[]
[]
[]
[]
[]
[]
[]
["CONTACT INFORMATION"]
["For assistance with this template or questions about compliance with the Australian Sustainability Reporting Standards, please contact:\n\nAvarni Pty Ltd\nEmail: support@avarni.co\nWebsite: www.avarni.co"]

{"sheet":"Flight Calculation Sheet","index":1,"n_rows":10,"n_cols":17,"rows_kept":10,"cut":false,"hidden":false,"merged":[[0,0,0,1]]}
["FLIGHT CALCULATION SHEET"]
[]
["Origin","Destination","Class","Num Passengers","Return?","Origin Airport","Destination Airport","Origin Country","Destination Country","Route","Origin Lat","Origin Lon","Destination Lat","Destination Lon","Distance (km)","Emissions (kg CO2e)","Notes"]
["SYD","MEL","Economy",5,"Return",{"$f":"_xlfn.XLOOKUP(Calculation[[#This Row],[Origin]], Airports[Lookup], Airports[Name], \"NOT FOUND\")","v":"Sydney Kingsford Smith International Airport"},{"$f":"_xlfn.XLOOKUP(Calculation[[#This Row],[Destination]], Airports[Lookup], Airports[Name], \"NOT FOUND\")","v":"Melbourne International Airport"},{"$f":"_xlfn.XLOOKUP(Calculation[[#This Row],[Origin]], Airports[Lookup], Airports[Country], \"NOT FOUND\")","v":"AU"},{"$f":"_xlfn.XLOOKUP(Calculation[[#This Row],[Destination]], Airports[Lookup], Airports[Country], \"NOT FOUND\")","v":"AU"},{"$f":"Calculation[[#This Row],[Origin]]  & \" → \" &  Calculation[[#This Row],[Destination]] & _xlfn.IFNA(\" \" & Calculation[[#This Row],[Return?]], \"\")","v":"SYD → MEL Return"},{"$f":"_xlfn.XLOOKUP(Calculation[[#This Row],[Origin]], Airports[Lookup], Airports[Lat], \"NOT FOUND\")","v":-33.946098327599998},{"$f":"_xlfn.XLOOKUP(Calculation[[#This Row],[Origin]], Airports[Lookup], Airports[Lon], \"NOT FOUND\")","v":151.17700195309999},{"$f":"_xlfn.XLOOKUP(Calculation[[#This Row],[Destination]], Airports[Lookup], Airports[Lat], \"NOT FOUND\")","v":-37.673301696800003},{"$f":"_xlfn.XLOOKUP(Calculation[[#This Row],[Destination]], Airports[Lookup], Airports[Lon], \"NOT FOUND\")","v":144.84300231930001},{"$f":"IFERROR(CALCULATE_DISTANCE(Calculation[[#This Row],[Origin Lat]], Calculation[[#This Row],[Origin Lon]], Calculation[[#This Row],[Destination Lat]], Calculation[[#This Row],[Destination Lon]]) * IF(Calculation[[#This Row],[Return?]] = \"Return\", 2, 1), \"N/A\")","v":1410.8033672960723},{"$f":"IFERROR(Calculation[[#This Row],[Distance (km)]]*Calculation[[#This Row],[Num Passengers]]*_xlfn.XLOOKUP(Calculation[[#This Row],[Class]], Factors[Class], Factors[Factor CO2e Value], \"N/A\"), \"N/A\")","v":949.82336703208057}]
["Sydney","Brisbane","Premium Economy",2,"Return",{"$f":"_xlfn.XLOOKUP(Calculation[[#This Row],[Origin]], Airports[Lookup], Airports[Name], \"NOT FOUND\")","v":"Sydney Kingsford Smith International Airport"},{"$f":"_xlfn.XLOOKUP(Calculation[[#This Row],[Destination]], Airports[Lookup], Airports[Name], \"NOT FOUND\")","v":"Brisbane International Airport"},{"$f":"_xlfn.XLOOKUP(Calculation[[#This Row],[Origin]], Airports[Lookup], Airports[Country], \"NOT FOUND\")","v":"AU"},{"$f":"_xlfn.XLOOKUP(Calculation[[#This Row],[Destination]], Airports[Lookup], Airports[Country], \"NOT FOUND\")","v":"AU"},{"$f":"Calculation[[#This Row],[Origin]]  & \" → \" &  Calculation[[#This Row],[Destination]] & _xlfn.IFNA(\" \" & Calculation[[#This Row],[Return?]], \"\")","v":"Sydney → Brisbane Return"},{"$f":"_xlfn.XLOOKUP(Calculation[[#This Row],[Origin]], Airports[Lookup], Airports[Lat], \"NOT FOUND\")","v":-33.946098327599998},{"$f":"_xlfn.XLOOKUP(Calculation[[#This Row],[Origin]], Airports[Lookup], Airports[Lon], \"NOT FOUND\")","v":151.17700195309999},{"$f":"_xlfn.XLOOKUP(Calculation[[#This Row],[Destination]], Airports[Lookup], Airports[Lat], \"NOT FOUND\")","v":-27.384199142500002},{"$f":"_xlfn.XLOOKUP(Calculation[[#This Row],[Destination]], Airports[Lookup], Airports[Lon], \"NOT FOUND\")","v":153.11700439449999},{"$f":"IFERROR(CALCULATE_DISTANCE(Calculation[[#This Row],[Origin Lat]], Calculation[[#This Row],[Origin Lon]], Calculation[[#This Row],[Destination Lat]], Calculation[[#This Row],[Destination Lon]]) * IF(Calculation[[#This Row],[Return?]] = \"Return\", 2, 1), \"N/A\")","v":1505.6435614073539},{"$f":"IFERROR(Calculation[[#This Row],[Distance (km)]]*Calculation[[#This Row],[Num Passengers]]*_xlfn.XLOOKUP(Calculation[[#This Row],[Class]], Factors[Class], Factors[Factor CO2e Value], \"N/A\"), \"N/A\")","v":648.69147199674433}]
["MEL","Auckland","Average",1,"One-Way",{"$f":"_xlfn.XLOOKUP(Calculation[[#This Row],[Origin]], Airports[Lookup], Airports[Name], \"NOT FOUND\")","v":"Melbourne International Airport"},{"$f":"_xlfn.XLOOKUP(Calculation[[#This Row],[Destination]], Airports[Lookup], Airports[Name], \"NOT FOUND\")","v":"Auckland International Airport"},{"$f":"_xlfn.XLOOKUP(Calculation[[#This Row],[Origin]], Airports[Lookup], Airports[Country], \"NOT FOUND\")","v":"AU"},{"$f":"_xlfn.XLOOKUP(Calculation[[#This Row],[Destination]], Airports[Lookup], Airports[Country], \"NOT FOUND\")","v":"NZ"},{"$f":"Calculation[[#This Row],[Origin]]  & \" → \" &  Calculation[[#This Row],[Destination]] & _xlfn.IFNA(\" \" & Calculation[[#This Row],[Return?]], \"\")","v":"MEL → Auckland One-Way"},{"$f":"_xlfn.XLOOKUP(Calculation[[#This Row],[Origin]], Airports[Lookup], Airports[Lat], \"NOT FOUND\")","v":-37.673301696800003},{"$f":"_xlfn.XLOOKUP(Calculation[[#This Row],[Origin]], Airports[Lookup], Airports[Lon], \"NOT FOUND\")","v":144.84300231930001},{"$f":"_xlfn.XLOOKUP(Calculation[[#This Row],[Destination]], Airports[Lookup], Airports[Lat], \"NOT FOUND\")","v":-37.008098602300002},{"$f":"_xlfn.XLOOKUP(Calculation[[#This Row],[Destination]], Airports[Lookup], Airports[Lon], \"NOT FOUND\")","v":174.7920074463},{"$f":"IFERROR(CALCULATE_DISTANCE(Calculation[[#This Row],[Origin Lat]], Calculation[[#This Row],[Origin Lon]], Calculation[[#This Row],[Destination Lat]], Calculation[[#This Row],[Destination Lon]]) * IF(Calculation[[#This Row],[Return?]] = \"Return\", 2, 1), \"N/A\")","v":2637.3610160414355},{"$f":"IFERROR(Calculation[[#This Row],[Distance (km)]]*Calculation[[#This Row],[Num Passengers]]*_xlfn.XLOOKUP(Calculation[[#This Row],[Class]], Factors[Class], Factors[Factor CO2e Value], \"N/A\"), \"N/A\")","v":463.64806662008442}]
["SYD","LAX","Business",1,null,{"$f":"_xlfn.XLOOKUP(Calculation[[#This Row],[Origin]], Airports[Lookup], Airports[Name], \"NOT FOUND\")","v":"Sydney Kingsford Smith International Airport"},{"$f":"_xlfn.XLOOKUP(Calculation[[#This Row],[Destination]], Airports[Lookup], Airports[Name], \"NOT FOUND\")","v":"Los Angeles International Airport"},{"$f":"_xlfn.XLOOKUP(Calculation[[#This Row],[Origin]], Airports[Lookup], Airports[Country], \"NOT FOUND\")","v":"AU"},{"$f":"_xlfn.XLOOKUP(Calculation[[#This Row],[Destination]], Airports[Lookup], Airports[Country], \"NOT FOUND\")","v":"US"},{"$f":"Calculation[[#This Row],[Origin]]  & \" → \" &  Calculation[[#This Row],[Destination]] & _xlfn.IFNA(\" \" & Calculation[[#This Row],[Return?]], \"\")","v":"SYD → LAX "},{"$f":"_xlfn.XLOOKUP(Calculation[[#This Row],[Origin]], Airports[Lookup], Airports[Lat], \"NOT FOUND\")","v":-33.946098327599998},{"$f":"_xlfn.XLOOKUP(Calculation[[#This Row],[Origin]], Airports[Lookup], Airports[Lon], \"NOT FOUND\")","v":151.17700195309999},{"$f":"_xlfn.XLOOKUP(Calculation[[#This Row],[Destination]], Airports[Lookup], Airports[Lat], \"NOT FOUND\")","v":33.942501069999999},{"$f":"_xlfn.XLOOKUP(Calculation[[#This Row],[Destination]], Airports[Lookup], Airports[Lon], \"NOT FOUND\")","v":-118.4079971},{"$f":"IFERROR(CALCULATE_DISTANCE(Calculation[[#This Row],[Origin Lat]], Calculation[[#This Row],[Origin Lon]], Calculation[[#This Row],[Destination Lat]], Calculation[[#This Row],[Destination Lon]]) * IF(Calculation[[#This Row],[Return?]] = \"Return\", 2, 1), \"N/A\")","v":12061.127845510589},{"$f":"IFERROR(Calculation[[#This Row],[Distance (km)]]*Calculation[[#This Row],[Num Passengers]]*_xlfn.XLOOKUP(Calculation[[#This Row],[Class]], Factors[Class], Factors[Factor CO2e Value], \"N/A\"), \"N/A\")","v":4709.1467560011542}]
["BNE","LHR","Economy",5,null,{"$f":"_xlfn.XLOOKUP(Calculation[[#This Row],[Origin]], Airports[Lookup], Airports[Name], \"NOT FOUND\")","v":"Brisbane International Airport"},{"$f":"_xlfn.XLOOKUP(Calculation[[#This Row],[Destination]], Airports[Lookup], Airports[Name], \"NOT FOUND\")","v":"London Heathrow Airport"},{"$f":"_xlfn.XLOOKUP(Calculation[[#This Row],[Origin]], Airports[Lookup], Airports[Country], \"NOT FOUND\")","v":"AU"},{"$f":"_xlfn.XLOOKUP(Calculation[[#This Row],[Destination]], Airports[Lookup], Airports[Country], \"NOT FOUND\")","v":"GB"},{"$f":"Calculation[[#This Row],[Origin]]  & \" → \" &  Calculation[[#This Row],[Destination]] & _xlfn.IFNA(\" \" & Calculation[[#This Row],[Return?]], \"\")","v":"BNE → LHR "},{"$f":"_xlfn.XLOOKUP(Calculation[[#This Row],[Origin]], Airports[Lookup], Airports[Lat], \"NOT FOUND\")","v":-27.384199142500002},{"$f":"_xlfn.XLOOKUP(Calculation[[#This Row],[Origin]], Airports[Lookup], Airports[Lon], \"NOT FOUND\")","v":153.11700439449999},{"$f":"_xlfn.XLOOKUP(Calculation[[#This Row],[Destination]], Airports[Lookup], Airports[Lat], \"NOT FOUND\")","v":51.470600128199997},{"$f":"_xlfn.XLOOKUP(Calculation[[#This Row],[Destination]], Airports[Lookup], Airports[Lon], \"NOT FOUND\")","v":-0.46194100380000003},{"$f":"IFERROR(CALCULATE_DISTANCE(Calculation[[#This Row],[Origin Lat]], Calculation[[#This Row],[Origin Lon]], Calculation[[#This Row],[Destination Lat]], Calculation[[#This Row],[Destination Lon]]) * IF(Calculation[[#This Row],[Return?]] = \"Return\", 2, 1), \"N/A\")","v":16543.262094392918},{"$f":"IFERROR(Calculation[[#This Row],[Distance (km)]]*Calculation[[#This Row],[Num Passengers]]*_xlfn.XLOOKUP(Calculation[[#This Row],[Class]], Factors[Class], Factors[Factor CO2e Value], \"N/A\"), \"N/A\")","v":11137.751205050032}]
["SYD","MEL","Premium Economy",3,null,{"$f":"_xlfn.XLOOKUP(Calculation[[#This Row],[Origin]], Airports[Lookup], Airports[Name], \"NOT FOUND\")","v":"Sydney Kingsford Smith International Airport"},{"$f":"_xlfn.XLOOKUP(Calculation[[#This Row],[Destination]], Airports[Lookup], Airports[Name], \"NOT FOUND\")","v":"Melbourne International Airport"},{"$f":"_xlfn.XLOOKUP(Calculation[[#This Row],[Origin]], Airports[Lookup], Airports[Country], \"NOT FOUND\")","v":"AU"},{"$f":"_xlfn.XLOOKUP(Calculation[[#This Row],[Destination]], Airports[Lookup], Airports[Country], \"NOT FOUND\")","v":"AU"},{"$f":"Calculation[[#This Row],[Origin]]  & \" → \" &  Calculation[[#This Row],[Destination]] & _xlfn.IFNA(\" \" & Calculation[[#This Row],[Return?]], \"\")","v":"SYD → MEL "},{"$f":"_xlfn.XLOOKUP(Calculation[[#This Row],[Origin]], Airports[Lookup], Airports[Lat], \"NOT FOUND\")","v":-33.946098327599998},{"$f":"_xlfn.XLOOKUP(Calculation[[#This Row],[Origin]], Airports[Lookup], Airports[Lon], \"NOT FOUND\")","v":151.17700195309999},{"$f":"_xlfn.XLOOKUP(Calculation[[#This Row],[Destination]], Airports[Lookup], Airports[Lat], \"NOT FOUND\")","v":-37.673301696800003},{"$f":"_xlfn.XLOOKUP(Calculation[[#This Row],[Destination]], Airports[Lookup], Airports[Lon], \"NOT FOUND\")","v":144.84300231930001},{"$f":"IFERROR(CALCULATE_DISTANCE(Calculation[[#This Row],[Origin Lat]], Calculation[[#This Row],[Origin Lon]], Calculation[[#This Row],[Destination Lat]], Calculation[[#This Row],[Destination Lon]]) * IF(Calculation[[#This Row],[Return?]] = \"Return\", 2, 1), \"N/A\")","v":705.40168364803617},{"$f":"IFERROR(Calculation[[#This Row],[Distance (km)]]*Calculation[[#This Row],[Num Passengers]]*_xlfn.XLOOKUP(Calculation[[#This Row],[Class]], Factors[Class], Factors[Factor CO2e Value], \"N/A\"), \"N/A\")","v":455.87289207437988}]
["Auckland","Singapore","Average",1,null,{"$f":"_xlfn.XLOOKUP(Calculation[[#This Row],[Origin]], Airports[Lookup], Airports[Name], \"NOT FOUND\")","v":"Auckland International Airport"},{"$f":"_xlfn.XLOOKUP(Calculation[[#This Row],[Destination]], Airports[Lookup], Airports[Name], \"NOT FOUND\")","v":"Singapore Changi International Airport"},{"$f":"_xlfn.XLOOKUP(Calculation[[#This Row],[Origin]], Airports[Lookup], Airports[Country], \"NOT FOUND\")","v":"NZ"},{"$f":"_xlfn.XLOOKUP(Calculation[[#This Row],[Destination]], Airports[Lookup], Airports[Country], \"NOT FOUND\")","v":"SG"},{"$f":"Calculation[[#This Row],[Origin]]  & \" → \" &  Calculation[[#This Row],[Destination]] & _xlfn.IFNA(\" \" & Calculation[[#This Row],[Return?]], \"\")","v":"Auckland → Singapore "},{"$f":"_xlfn.XLOOKUP(Calculation[[#This Row],[Origin]], Airports[Lookup], Airports[Lat], \"NOT FOUND\")","v":-37.008098602300002},{"$f":"_xlfn.XLOOKUP(Calculation[[#This Row],[Origin]], Airports[Lookup], Airports[Lon], \"NOT FOUND\")","v":174.7920074463},{"$f":"_xlfn.XLOOKUP(Calculation[[#This Row],[Destination]], Airports[Lookup], Airports[Lat], \"NOT FOUND\")","v":1.3501900434},{"$f":"_xlfn.XLOOKUP(Calculation[[#This Row],[Destination]], Airports[Lookup], Airports[Lon], \"NOT FOUND\")","v":103.9940032959},{"$f":"IFERROR(CALCULATE_DISTANCE(Calculation[[#This Row],[Origin Lat]], Calculation[[#This Row],[Origin Lon]], Calculation[[#This Row],[Destination Lat]], Calculation[[#This Row],[Destination Lon]]) * IF(Calculation[[#This Row],[Return?]] = \"Return\", 2, 1), \"N/A\")","v":8408.3307916723243},{"$f":"IFERROR(Calculation[[#This Row],[Distance (km)]]*Calculation[[#This Row],[Num Passengers]]*_xlfn.XLOOKUP(Calculation[[#This Row],[Class]], Factors[Class], Factors[Factor CO2e Value], \"N/A\"), \"N/A\")","v":1478.1845531759948}]

{"sheet":"Dashboard","index":2,"n_rows":44,"n_cols":2,"rows_kept":44,"cut":false,"hidden":false,"merged":[[0,0,0,1]]}
["DASHBOARD"]
[]
["Class","Sum of Emissions (kg CO2e)"]
["Average",1941.8326197960791]
["Business",4709.1467560011542]
["Economy",12087.574572082112]
["Premium Economy",1104.5643640711241]
["Grand Total",19843.118311950468]
[]
[]
[]
[]
[]
[]
[]
[]
[]
[]
[]
[]
[]
[]
[]
[]
[]
[]
[]
[]
[]
[]
[]
[]
[]
[]
[]
["Route","Sum of Emissions (kg CO2e)"]
["BNE → LHR ",11137.751205050032]
["SYD → LAX ",4709.1467560011542]
["Auckland → Singapore ",1478.1845531759948]
["SYD → MEL Return",949.82336703208057]
["Sydney → Brisbane Return",648.69147199674433]
["MEL → Auckland One-Way",463.64806662008442]
["SYD → MEL ",455.87289207437988]
["Grand Total",19843.118311950468]

{"sheet":"Emission Factors","index":3,"n_rows":8,"n_cols":6,"rows_kept":8,"cut":false,"hidden":false,"merged":[[0,0,0,1]]}
["EMISSION FACTORS"]
[]
["Class","Factor Name","Factor CO2e Value","Factor Unit","Factor Source Name","Factor Source Link"]
["Economy","International, to/from non-UK, Economy class, With RF",0.13464999999999999,"passenger-km","DEFRA","https://www.gov.uk/government/publications/greenhouse-gas-reporting-conversion-factors-2024"]
["Premium Economy","International, to/from non-UK, Premium economy class, With RF",0.21542,"passenger-km","DEFRA","https://www.gov.uk/government/publications/greenhouse-gas-reporting-conversion-factors-2024"]
["Business","International, to/from non-UK, Business class, With RF",0.39044000000000001,"passenger-km","DEFRA","https://www.gov.uk/government/publications/greenhouse-gas-reporting-conversion-factors-2024"]
["First","International, to/from non-UK, First class, With RF",0.53854000000000002,"passenger-km","DEFRA","https://www.gov.uk/government/publications/greenhouse-gas-reporting-conversion-factors-2024"]
["Average","International, to/from non-UK,  Average passenger, With RF",0.17580000000000001,"passenger-km","DEFRA","https://www.gov.uk/government/publications/greenhouse-gas-reporting-conversion-factors-2024"]

{"sheet":"Lists","index":4,"n_rows":3,"n_cols":1,"rows_kept":3,"cut":false,"hidden":true,"merged":[]}
["Return?"]
["One-Way"]
["Return"]

{"sheet":"Airports","index":5,"n_rows":8736,"n_cols":5,"rows_kept":8736,"cut":false,"hidden":true,"merged":[]}
["Lookup","Name","Country","Lat","Lon"]
["NYS","New York Skyports Seaplane Base","US",40.733990830000003,-73.972916380000001]
["ICY","Icy Bay Airport","US",59.969001769999998,-141.66200256299999]
["HGZ","Hog River Airport","US",66.216102599999999,-155.66900630000001]
["BYW","Blakely Island Airport","US",48.578998565699997,-122.825996399]
["BDF","Rinkenberger Restricted Landing Area","US",41.230899810799997,-89.615699768100001]
["BCS","Southern Seaplane Airport","US",29.866100311299999,-90.022201538100006]
["BWL","Blackwell Tonkawa Municipal Airport","US",36.745098110000001,-97.349601750000005]
["DUF","Pine Island Airport","US",36.253501892099997,-75.788497924799998]
["FOB","Fort Bragg Airport","US",39.474300384499998,-123.79599761999999]
["AFT","Afutara Aerodrome","SB",-9.1913888889000006,160.94861111099999]
["RNA","Ulawa Airport","SB",-9.8605435826000001,161.97954654700001]
["ATD","Uru Harbour Airport","SB",-8.8733301163,161.01100158689999]
["VEV","Barakoma Airport","SB",-7.9127798079999998,156.70599365230001]
["BPF","Batuna Aerodrome","SB",-8.5620277777999991,158.119305556]
["GEF","Geva Airport","SB",-7.5758299828000002,156.59700012210001]
["AKS","Auki Airport","SB",-8.7025699616000001,160.682006836]
["BNY","Bellona/Anua Airport","SB",-11.302222222199999,159.79833333299999]
["CHY","Choiseul Bay Airport","SB",-6.7119439999999999,156.39611099999999]
["BAS","Ballalae Airport","SB",-6.9907450000000004,155.88665599999999]
["FRE","Fera/Maringe Airport","SB",-8.1075000762999991,159.5769958496]
["HIR","Honiara International Airport","SB",-9.4280004501000008,160.05499267580001]
["MBU","Babanakira Airport","SB",-9.7475004195999997,159.8390045166]
["AVU","Avu Avu Airport","SB",-9.8683333333000007,160.41055555599999]
["IRA","Ngorangora Airport","SB",-10.449700355499999,161.89799499509999]
["SCZ","Santa Cruz/Graciosa Bay/Luova Airport","SB",-10.7202997208,165.79499816890001]
["MUA","Munda Airport","SB",-8.3279695511000007,157.26300048830001]
["GZO","Nusatupe Airport","SB",-8.0977802276999995,156.86399841299999]
["MNY","Mono Airport","SB",-7.4169402122000001,155.5650024414]
["PRS","Parasi Airport","SB",-9.6416702271000005,161.42500305179999]
["RNL","Rennell/Tingoa Airport","SB",-11.533900260899999,160.06300354000001]
["EGM","Sege Airport","SB",-8.5788898467999992,157.87600708010001]
["NNB","Santa Ana Airport","SB",-10.847994,162.45410799999999]
["RUS","Marau Airport","SB",-9.8616695403999994,160.82499694800001]
["VAO","Suavanao Airport","SB",-7.5855598449999997,158.73100280759999]
["XYA","Yandina Airport","SB",-9.0928159999999991,159.21841000000001]
["KGE","Kagau Island Airport","SB",-7.3330001831000002,157.5829925537]
["KWS","Kwailabesi Airport","SB",-8.3605079999999994,160.775127]
["GTA","Gatokae Airport","SB",-8.7391670000000001,158.203056]
["RIN","Ringi Cove Airport","SB",-8.1263904571999994,157.1430053711]
["RBV","Ramata Airport","SB",-8.1680603027000007,157.6430053711]
["CEX","Chena Hot Springs Airport","US",65.0518035889,-146.04699707]
["HED","Herendeen Bay Airport","US",55.801399230999998,-160.899002075]
["TWE","Taylor Airport","US",65.679298400899995,-164.798995972]
["CDL","Candle 2 Airport","US",65.907699585000003,-161.92599487300001]
["BSZ","Bartletts Airport","US",58.216201782200002,-157.352005005]
["BSW","Boswell Bay Airport","US",60.423099517799997,-146.145996094]
["INU","Nauru International Airport","NR",-0.547458,166.919006]
["ATP","Aitape Airport","PG",-3.1436111110999998,142.34680555599999]
["AMU","Amanab Airport","PG",-3.5859999999999999,141.21433333300001]
["ADC","Andakombe Airport","PG",-7.1372222222000001,145.74472222200001]
["AIE","Aiome Airport","PG",-5.1456999779999997,144.7307003]
["KPM","Kompiam Airport","PG",-5.3816666667000002,143.92472222200001]
["AUJ","Ambunti Airport","PG",-4.2156666666999998,142.82316666700001]
["AWB","Awaba Airport","PG",-8.0061101913999995,142.74835205100001]
["AYU","Aiyura Airport","PG",-6.3380555555999996,145.904166667]
["VMU","Baimuru Airport","PG",-7.4968600273000003,144.81990051299999]
["BDZ","Baindoung Airport","PG",-6.3472222222000001,146.942222222]
["BUA","Buka Airport","PG",-5.4223198890999997,154.6730041504]
["OPU","Balimo Airport","PG",-8.0500001907000005,142.93299865700001]
["BUL","Bulolo Airport","PG",-7.2162866713999998,146.649541855]
["CMU","Chimbu Airport","PG",-6.0242900847999996,144.970993042]
["DER","Derim Airport","PG",-6.1447222222000004,147.10722222199999]
["DAU","Daru Airport","PG",-9.0867595672999997,143.20799255399999]
["XYR","Edwaki Airport","PG",-3.8839860000000002,141.79223400000001]
["FNE","Fane Airport","PG",-8.5492777778000004,147.08583333300001]
["FIN","Finschhafen Airport","PG",-6.6217501089999997,147.85405]
["FAQ","Frieda River Airport","PG",-4.610468,141.960138]
["GKA","Goroka Airport","PG",-6.0816898345999997,145.39199829099999]
["GRL","Garasa Airport","PG",-7.9807129999999997,147.213461]
["GAR","Garaina Airport","PG",-7.8756250274999999,147.14126586899999]
["GUR","Gurney Airport","PG",-10.311499595600001,150.33399963400001]
["GAP","Gusap Airport","PG",-6.0531959999999998,145.959047]
["PNP","Girua Airport","PG",-8.8045396804999996,148.30900573700001]
["GMI","Gasmata Island Airport","PG",-6.2711100577999996,150.33099365199999]
["GVI","Green River Airport","PG",-3.9022428989,141.17051696799999]
["HKN","Kimbe Airport","PG",-5.4621701241,150.4049987793]
["KIE","Aropa Airport","PG",-6.3049999999999997,155.727778]
["LSA","Losuia Airport","PG",-8.5058202743999995,151.08099365230001]
["KBM","Kabwum","PG",-6.1554722222000002,147.19147222199999]
["KDR","Kandrian Airport","PG",-6.2659000000000002,149.5581]
["UNG","Kiunga Airport","PG",-6.1257100104999997,141.28199768069999]
["KRI","Kikori Airport","PG",-7.4243798256,144.25007629390001]
["KMA","Kerema Airport","PG",-7.9636101723000001,145.770996094]
["KKD","Kokoda Airport","PG",-8.8846788405999995,147.730957031]
["KZF","Kaintiba Airport","PG",-7.5002500000000003,146.03383333299999]
["KUQ","Kuri Airport","PG",-7.1350829999999998,143.27611099999999]
["KVG","Kavieng Airport","PG",-2.5794000626,150.80799865700001]
["KWO","Kawito Airport","PG",-7.9770069122000002,142.82357788100001]
["LNV","Londolovit Airport","PG",-3.0436100960000001,152.628997803]
["LMY","Lake Murray Airport","PG",-7.0099201202000003,141.49400329599999]
["LMI","Lumi Airport","PG",-3.4768395113000001,142.041292191]
["MYX","Menyamya Airport","PG",-7.2116666667000002,146.01936111099999]
["MAG","Madang Airport","PG",-5.2070798873999999,145.78900146500001]
["HGU","Mount Hagen Kagamuga Airport","PG",-5.8267898560000004,144.29600524899999]
["MXK","Mindik Airport","PG",-6.4716666667,147.441138889]
["GUV","Mougulu Airport","PG",-6.2808590000000004,142.42077499999999]
["MDU","Mendi Airport","PG",-6.1477398872000002,143.65699768069999]
["MAS","Momote Airport","PG",-2.0618898869,147.42399597170001]
["MXH","Moro Airport","PG",-6.3633298873999999,143.238006592]
["MIS","Misima Island Airport","PG",-10.689200401300001,152.83799743700001]
["GBF","Negarbo(Negabo) Airport","PG",-6.5677779999999997,144.703058]
["MFO","Manguna Airport","PG",-5.5777780000000003,151.79233300000001]
["UKU","Nuku Airport","PG",-3.6766510000000001,142.48433399999999]
["LAE","Lae Nadzab Airport","PG",-6.5698299408,146.725997925]
["OGE","Ogeranang Airport","PG",-6.4667500000000002,147.36416666700001]
["OSE","Omora Airport","PG",-7.8277777777999997,147.080638889]
["PDI","Pindiu Airport","PG",-6.4451388888999999,147.51583333299999]
["POM","Port Moresby Jacksons International Airport","PG",-9.4433803558000005,147.2200012207]
["KRJ","Karawari Airstrip","PG",-4.5966666667,143.52250000000001]
["RMN","Rumginae Airport","PG",-5.8972222221999999,141.27166666700001]
["KMR","Karimui Airport","PG",-6.4920999999999998,144.82300000000001]
["SBE","Suabi Airport","PG",-6.1044444444000003,142.27833333300001]
["NIS","Simberi Airport","PG",-2.6622222222,151.997777778]
["SIL","Sila Airport","PG",-9.0735555556000005,148.38925]
["SIM","Simbai Airport","PG",-5.2786111111,144.54472222199999]
["SKC","Suki Airport","PG",-8.0465999999999998,141.72219999999999]
["TIZ","Tari Airport","PG",-5.8449997902000002,142.947998047]
["TBG","Tabubil Airport","PG",-5.2786102294999999,141.2259979248]
["TFM","Telefomin Airport","PG",-5.1260804642000002,141.641921997]
["TPI","Tapini Airport","PG",-8.3566666667000007,146.98916666700001]
["TAJ","Tadji Airport","PG",-3.1981918034999999,142.43096351599999]
["RAB","Tokua Airport","PG",-4.3404598235999998,152.380004883]
["TKW","Tekin Airport","PG",-5.2436666667000003,142.16519444400001]
["TFI","Tufi Airport","PG",-9.0759544373000001,149.31983947800001]
["VAI","Vanimo Airport","PG",-2.6971700191000001,141.30200195309999]
["WAO","Wabo Airport","PG",-6.9894444444000001,145.07511111100001]
["WBM","Wapenamanda Airport","PG",-5.6433000565000002,143.89500427249999]
["AGL","Wanigela Airport","PG",-9.3375000000000004,149.155555556]
["WWK","Wewak International Airport","PG",-3.5838301181999999,143.66900634800001]
["WOA","Wonenara Airport","PG",-6.7968611111000001,145.89194444399999]
["WSU","Wasu Airport","PG",-5.9617094491999998,147.19822525999999]
["WTP","Woitape Airport","PG",-8.5458333332999992,147.2525]
["WUG","Wau Airport","PG",-7.3455555555999998,146.718611111]
["JEG","Aasiaat Airport","GL",68.721801757799994,-52.784698486300002]
["UAK","Narsarsuaq Airport","GL",61.160499572799999,-45.425998687700002]
["CNP","Neerlerit Inaat Airport","GL",70.743103027299995,-22.650499343900002]
["GOH","Godthaab / Nuuk Airport","GL",64.190902710000003,-51.678100585899998]
["JAV","Ilulissat Airport","GL",69.243202209499998,-51.057098388699998]
["KUS","Kulusuk Airport","GL",65.573600768999995,-37.123600006099998]
["JSU","Maniitsoq Airport","GL",65.412498474100005,-52.939399719199997]
["JFR","Paamiut Airport","GL",62.014736175499998,-49.670936584499998]
["NAQ","Qaanaaq Airport","GL",77.488601684599999,-69.388702392599996]
["SFJ","Kangerlussuaq Airport","GL",67.0122218992,-50.711603164700001]
["JHS","Sisimiut Airport","GL",66.951301574699997,-53.729301452599998]
["THU","Thule Air Base","GL",76.531196594199997,-68.703201293899994]
["JUV","Upernavik Airport","GL",72.790199279800007,-56.130599975599999]
["JQA","Qaarsut Airport","GL",70.734199523900003,-52.696201324500002]
["AEY","Akureyri Airport","IS",65.660003662099996,-18.072700500500002]
["BIU","Bildudalur Airport","IS",65.641296386700006,-23.5461997986]
["BGJ","Borgarfjordur eystri Airport","IS",65.516403198199995,-13.8050003052]
["BJD","Bakkafjordur Airport","IS",66.021896362299998,-14.8243999481]
["BLO","Hjaltabakki Airport","IS",65.644996643100001,-20.287500381499999]
["BQD","Budardalur Airport","IS",65.075302124000004,-21.800300598100002]
["BXV","Breiddalsvik Airport","IS",64.790000915500002,-14.0228004456]
["DJU","Djupivogur Airport","IS",64.644203185999999,-14.2827997208]
["EGS","Egilsstadir Airport","IS",65.283302307100001,-14.401399612400001]
["FAS","Faskrudsfjordur Airport","IS",64.931701660200005,-14.060600280799999]
["FAG","Fagurholsmyri Airport","IS",63.8746986389,-16.641099929799999]
["GUU","Grundarfjordur Airport","IS",64.991401672400002,-23.224700927699999]
["GJR","Gjogur Airport","IS",65.995300293,-21.326900482199999]
["GRY","Grimsey Airport","IS",66.5458,-18.017299999999999]
["HVK","Holmavik Airport","IS",65.704696655299998,-21.696399688700001]
["HFN","Hornafjordur Airport","IS",64.295600891099994,-15.2271995544]
["FLI","Holt Airport","IS",66.0141804294,-23.4416913986]
["HZK","Husavik Airport","IS",65.952301025400004,-17.4260005951]
["HVM","Krokstadarmelar Airport","IS",65.266403198199995,-20.846900939899999]
["HLO","Ingjaldssandur Airport","IS",66.050003051800005,-23.696100234999999]
["IFJ","Isafjordur Airport","IS",66.058097839400006,-23.135299682599999]
["KEF","Keflavik International Airport","IS",63.9850006104,-22.605600357099998]
["OPA","Kopasker Airport","IS",66.310798645000006,-16.466699600199998]
["SAK","Saudarkrokur Airport","IS",65.731697082500006,-19.572799682599999]
["NOR","Nordfjordur Airport","IS",65.131896972700005,-13.7463998795]
["OFJ","Olafsfjordur Airport","IS",66.083297729500003,-18.6667003632]
["PFJ","Patreksfjordur Airport","IS",65.555801391599999,-23.965000152599998]
["RHA","Reykholar Airport","IS",65.452629089400006,-22.206115722700002]
["OLI","Rif Airport","IS",64.911399841299996,-23.8230991364]
["RFN","Raufarhofn Airport","IS",66.406402587900004,-15.918299675]
["RKV","Reykjavik Airport","IS",64.129997253400006,-21.940599441500002]
["MVA","Reykjahlid Airport","IS",65.655799865700004,-16.918100357099998]
["SIJ","Siglufjordur Airport","IS",66.133300781299994,-18.9167003632]
["SYK","Stykkisholmur Airport","IS",65.058097839400006,-22.7942008972]
["TEY","Tingeyri Airport","IS",65.870300293,-23.559999465899999]
["THO","Thorshofn Airport","IS",66.218498229999994,-15.3355998993]
["VEY","Vestmannaeyjar Airport","IS",63.424301147500003,-20.2789001465]
["VPN","Vopnafjordur Airport","IS",65.720596313499996,-14.850600242600001]
["PRN","Pristina International Airport","KS",42.572799682599999,21.035800933800001]
["YZZ","Trail Airport","CA",49.055599212600001,-117.60900116000001]
["YAA","Anahim Lake Airport","CA",52.4524993896,-125.3030014038]
["DGF","Douglas Lake Airport","CA",50.165460048500002,-120.171273351]
["JHL","Fort MacKay/Albian Aerodrome","CA",57.223899841300003,-111.418998718]
["DUQ","Duncan Airport","CA",48.754533620399997,-123.70970249200001]
["ZEL","Denny Island Airport","CA",52.139701843300003,-128.063995361]
["YBO","Bob Quinn Lake Airport","CA",56.9667015076,-130.25]
["YWM","Williams Harbour Airport","CA",52.5668983459,-55.784698486300002]
["YSO","Postville Airport","CA",54.910598754900001,-59.786701202400003]
["YBI","Black Tickle Airport","CA",53.469398498499999,-55.784999847400002]
["YFX","St. Lewis (Fox Harbour) Airport","CA",52.372798919700003,-55.6739006042]
["YHA","Port Hope Simpson Airport","CA",52.528099060099997,-56.286098480200003]
["YRG","Rigolet Airport","CA",54.179698944099997,-58.457500457800002]
["DVK","Diavik Airport","CA",64.511398315400001,-110.289001465]
["YCK","Colville Lake Airport","CA",67.033302307100001,-126.0830001831]
["YLE","Whati Airport","CA",63.131698608400001,-117.2460021973]
["NML","Fort McMurray / Mildred Lake Airport","CA",57.055599212600001,-111.573997498]
["ZSP","St. Paul Airport","CA",53.993301391599999,-111.379997253]
["DAS","Great Bear Lake Airport","CA",66.703102111800007,-119.707000732]
["YFI","Fort Mackay / Firebag","CA",57.275833334399998,-110.976666667]
["SUR","Summer Beaver Airport","CA",52.708599090600003,-88.541900634800001]
["YAX","Wapekeka Airport","CA",53.849201202400003,-89.579399108900006]
["WNN","Wunnumin Lake Airport","CA",52.893901825,-89.289199829099999]
["YNO","North Spirit Lake Airport","CA",52.490001678500001,-92.971099853499993]
["XBE","Bearskin Lake Airport","CA",53.965599060099997,-91.027198791499998]
["YPD","Parry Sound Area Municipal Airport","CA",45.257499694800003,-79.829696655299998]
["KIF","Kingfisher Lake Airport","CA",53.012500762899997,-89.855300903300005]
["YOG","Ogoki Post Airport","CA",51.6585998535,-85.901702880900004]
["YEB","Bar River Airport","CA",46.420299530000001,-84.092201232899995]
["YHP","Poplar Hill Airport","CA",52.113300323499999,-94.255599975600006]
["KEW","Keewaywin Airport","CA",52.991100311300002,-92.836402893100001]
["YSA","Sable Island Landing Strip","CA",43.930353521199997,-59.959774017299999]
["YNX","Snap Lake Airport","CA",63.593601226799997,-110.90599822999999]
["YKU","Chisasibi Airport","CA",53.805599212600001,-78.916900634800001]
["ZTB","Tete-a-la-Baleine Airport","CA",50.674400329599997,-59.383598327599998]
["ZKG","Kegaska Airport","CA",50.195800781300001,-61.265800476099997]
["YAU","Donaldson Airport","CA",61.662200927699999,-73.321403503400006]
["ZLT","La Tabatiere Airport","CA",50.8307991028,-58.975601196299998]
["YAB","Arctic Bay Airport","CA",73.005766817400001,-85.042505264300004]
["YAC","Cat Lake Airport","CA",51.727199554400002,-91.8244018555]
["YAR","La Grande-3 Airport","CA",53.571701049799998,-76.196403503400006]
["YAG","Fort Frances Municipal Airport","CA",48.6542015076,-93.439697265600003]
["YAH","La Grande-4 Airport","CA",53.754699707,-73.675300598099994]
["YAL","Alert Bay Airport","CA",50.582199096700002,-126.9160003662]
["YAM","Sault Ste Marie Airport","CA",46.4850006104,-84.509399414100002]
["XKS","Kasabonika Airport","CA",53.524700164800002,-88.642799377399996]
["YKG","Kangirsuk Airport","CA",60.027198791499998,-69.999198913599997]
["YAT","Attawapiskat Airport","CA",52.927501678500001,-82.431900024399994]
["YAV","Winnipeg / St. Andrews Airport","CA",50.056400299099998,-97.032501220699999]
["YAW","Shearwater Airport","CA",44.637222000000001,-63.502222000000003]
["YAY","St. Anthony Airport","CA",51.391899108899999,-56.083099365199999]
["YAZ","Tofino / Long Beach Airport","CA",49.079825546400002,-125.77560424799999]
["YBA","Banff Airport","CA",51.207340469899997,-115.54186105700001]
["YBB","Kugaaruk Airport","CA",68.534400939899996,-89.808097839400006]
["YBC","Baie Comeau Airport","CA",49.132499694800003,-68.204399108900006]
["QBC","Bella Coola Airport","CA",52.387500762899997,-126.59600067140001]
["YBE","Uranium City Airport","CA",59.561401367199998,-108.48100280760001]
["YBY","Bonnyville Airport","CA",54.304199218800001,-110.7440032959]
["YBG","CFB Bagotville","CA",48.330600738500003,-70.996398925799994]
["YBK","Baker Lake Airport","CA",64.298896789599993,-96.077796935999999]
["YBL","Campbell River Airport","CA",49.950801849400001,-125.27100372309999]
["XTL","Tadoule Lake Airport","CA",58.7061004639,-98.512199401900006]
["YBR","Brandon Municipal Airport","CA",49.909999847400002,-99.951896667499994]
["YBT","Brochet Airport","CA",57.889400482200003,-101.6790008545]
["YBV","Berens River Airport","CA",52.358898162800003,-97.018302917499994]
["YBW","Calgary / Springbank Airport","CA",51.103099823000001,-114.374000549]
["YBX","Lourdes de Blanc Sablon Airport","CA",51.443599700900002,-57.185298919700003]
["YRF","Cartwright Airport","CA",53.682800293,-57.041900634800001]
["YCB","Cambridge Bay Airport","CA",69.108100891099994,-105.138000488]
["YCC","Cornwall Regional Airport","CA",45.092800140400001,-74.563301086400003]
["YCD","Nanaimo Airport","CA",49.052299499500002,-123.87000274659999]
["YCE","James T. Field Memorial Aerodrome","CA",43.285598754900001,-81.508300781299994]
["YCG","Castlegar/West Kootenay Regional Airport","CA",49.296398162800003,-117.63200378400001]
["YCH","Miramichi Airport","CA",47.007801055900003,-65.449203491199995]
["XCM","Chatham Kent Airport","CA",42.306400299099998,-82.081901550300003]
["YCL","Charlo Airport","CA",47.990798950200002,-66.330299377399996]
["YCN","Cochrane Airport","CA",49.105598449699997,-81.013603210400007]
["YCO","Kugluktuk Airport","CA",67.816703796400006,-115.143997192]
["YCQ","Chetwynd Airport","CA",55.6871986389,-121.6269989014]
["YCR","Cross Lake (Charlie Sinclair Memorial) Airport","CA",54.610599517799997,-97.760803222700005]
["YCS","Chesterfield Inlet Airport","CA",63.346900939900003,-90.731101989699994]
["YCT","Coronation Airport","CA",52.075000762899997,-111.4449996948]
["YCW","Chilliwack Airport","CA",49.152801513699998,-121.9390029907]
["YCY","Clyde River Airport","CA",70.486099243200002,-68.516700744600001]
["YCZ","Fairmont Hot Springs Airport","CA",50.330299377400003,-115.87300109900001]
["YDA","Dawson City Airport","CA",64.043098449699997,-139.12800598140001]
["YDB","Burwash Airport","CA",61.371101379400002,-139.0410003662]
["YDC","Princeton Airport","CA",49.468101501500001,-120.511001587]
["YDF","Deer Lake Airport","CA",49.210800170900001,-57.391399383500001]
["YDL","Dease Lake Airport","CA",58.4221992493,-130.03199768069999]
["YDM","Ross River Airport","CA",61.970600128199997,-132.4230041504]
["YDN","Dauphin Barker Airport","CA",51.1007995605,-100.0520019531]
["YDO","Dolbeau St Felicien Airport","CA",48.778499603299998,-72.375]
["YDP","Nain Airport","CA",56.549198150599999,-61.680301666299997]
["YDQ","Dawson Creek Airport","CA",55.742298126199998,-120.1829986572]
["YEE","Huronia Airport","CA",44.683300018300002,-79.928298950200002]
["YEG","Edmonton International Airport","CA",53.309700012199997,-113.580001831]
["YEK","Arviat Airport","CA",61.094200134300003,-94.070800781200006]
["YEL","Elliot Lake Municipal Airport","CA",46.351398467999999,-82.561401367200006]
["YEM","Manitoulin East Municipal Airport","CA",45.842800140400001,-81.858100891099994]
["YEN","Estevan Airport","CA",49.210300445599998,-102.966003418]
["YER","Fort Severn Airport","CA",56.018901825,-87.676101684599999]
["YET","Edson Airport","CA",53.578899383500001,-116.46499633800001]
["YEU","Eureka Airport","CA",79.9946975708,-85.814201354999994]
["YEV","Inuvik Mike Zubko Airport","CA",68.304199218799994,-133.48300170900001]
["YEY","Amos Magny Airport","CA",48.563899993900002,-78.249702453599994]
["YFA","Fort Albany Airport","CA",52.201400756799998,-81.696899414100002]
["YFB","Iqaluit Airport","CA",63.756401062000002,-68.555801391599999]
["YFC","Fredericton Airport","CA",45.868900299099998,-66.537200927699999]
["YFD","Brantford Municipal Airport","CA",43.131401062000002,-80.342498779300001]
["YFE","Forestville Airport","CA",48.746101379400002,-69.097198486300002]
["YFH","Fort Hope Airport","CA",51.561901092500001,-87.907798767100005]
["YTM","La Macaza / Mont-Tremblant International Inc Airport","CA",46.409400939900003,-74.779998779300001]
["YFO","Flin Flon Airport","CA",54.678100585899998,-101.6819992065]
["YFR","Fort Resolution Airport","CA",61.180801391599999,-113.690002441]
["YFS","Fort Simpson Airport","CA",61.760200500499998,-121.23699951170001]
["YMN","Makkovik Airport","CA",55.076900482200003,-59.186401367199998]
["YGB","Texada Gillies Bay Airport","CA",49.694198608400001,-124.5179977417]
["YGD","Goderich Airport","CA",43.766899108899999,-81.710601806599996]
["YGE","Golden Airport","CA",51.299198150599999,-116.9820022583]
["YGH","Fort Good Hope Airport","CA",66.240798950200002,-128.65100097659999]
["YGK","Kingston Norman Rogers Airport","CA",44.225299835199998,-76.596900939899996]
["YGL","La Grande Riviere Airport","CA",53.6253013611,-77.704200744600001]
["YGM","Gimli Industrial Park Airport","CA",50.628101348900003,-97.043296814000001]
["YGO","Gods Lake Narrows Airport","CA",54.558898925800001,-94.491401672400002]
["YGP","Gaspe (Michel-Pouliot) Airport","CA",48.775299072300001,-64.478599548299997]
["YGQ","Geraldton Greenstone Regional Airport","CA",49.778301239000001,-86.939399719199997]
["YGR","Iles-de-la-Madeleine Airport","CA",47.424701690699997,-61.778099060099997]
["YGT","Igloolik Airport","CA",69.364700317399993,-81.816101074200006]
["YGV","Havre St Pierre Airport","CA",50.281898498499999,-63.6114006042]
["YGW","Kuujjuarapik Airport","CA",55.281898498499999,-77.765296935999999]
["YGX","Gillam Airport","CA",56.357498168900001,-94.710601806599996]
["YGZ","Grise Fiord Airport","CA",76.426101684599999,-82.909202575699993]
["YQC","Quaqtaq Airport","CA",61.046398162800003,-69.617797851600002]
["YHB","Hudson Bay Airport","CA",52.816699981699998,-102.3109970093]
["YHD","Dryden Regional Airport","CA",49.831699371299997,-92.744201660200005]
["YHE","Hope Airport","CA",49.368301391599999,-121.49800109900001]
["YHF","Hearst Rene Fontaine Municipal Airport","CA",49.714199066200003,-83.686096191399997]
["YNS","Nemiscau Airport","CA",51.691101074199999,-76.135597228999998]
["YHI","Ulukhaktok Holman Airport","CA",70.762802124000004,-117.8059997559]
["YHK","Gjoa Haven Airport","CA",68.635597228999998,-95.849700927699999]
["YHM","John C. Munro Hamilton International Airport","CA",43.173599243200002,-79.934997558600003]
["YHN","Hornepayne Municipal Airport","CA",49.193099975599999,-84.758903503400006]
["YHO","Hopedale Airport","CA",55.448299407999997,-60.228599548299997]
["YHR","Chevery Airport","CA",50.468898773200003,-59.636699676500001]
["YHT","Haines Junction Airport","CA",60.789199829099999,-137.54600524899999]
["YHU","Montreal / Saint-Hubert Airport","CA",45.517501831099999,-73.416900634800001]
["YHY","Hay River / Merlyn Carter Airport","CA",60.839698791499998,-115.782997131]
["YHZ","Halifax / Stanfield International Airport","CA",44.880798339800002,-63.508598327599998]
["YIB","Atikokan Municipal Airport","CA",48.773899078399999,-91.638603210400007]
["YDG","Digby / Annapolis Regional Airport","CA",44.545845036499998,-65.785424709300003]
["YIF","St Augustin Airport","CA",51.2117004395,-58.6582984924]
["YIK","Ivujivik Airport","CA",62.417301178000002,-77.925300598099994]
["YIO","Pond Inlet Airport","CA",72.683296203599994,-77.966697692899999]
["YIV","Island Lake Airport","CA",53.857200622599997,-94.653602600100001]
["YJA","Jasper Airport","CA",52.996700286900001,-118.0589981079]
["YJF","Fort Liard Airport","CA",60.235801696800003,-123.46900177000001]
["YJM","Fort St James Airport","CA",54.397201538099999,-124.26300048829999]
["YJN","St Jean Airport","CA",45.294399261499997,-73.281097412099996]
["YJT","Stephenville Airport","CA",48.5442008972,-58.549999237100003]
["YKA","Kamloops Airport","CA",50.702201843300003,-120.4440002441]
["YKC","Collins Bay Airport","CA",58.236099243200002,-103.6780014038]
["LAK","Aklavik Airport","CA",68.223297119099996,-135.0059967041]
["YKF","Waterloo Airport","CA",43.460800170900001,-80.378601074200006]
["YWB","Kangiqsujuaq (Wakeham Bay) Airport","CA",61.588600158699997,-71.929397582999997]
["YKJ","Key Lake Airport","CA",57.256099700900002,-105.61799621580001]
["YKL","Schefferville Airport","CA",54.805301666299997,-66.805297851600002]
["AKV","Akulivik Airport","CA",60.818599700900002,-78.148597717300007]
["YKQ","Waskaganish Airport","CA",51.473300933799997,-78.758300781299994]
["YKX","Kirkland Lake Airport","CA",48.210300445599998,-79.9813995361]
["YKY","Kindersley Airport","CA",51.517501831099999,-109.18099975600001]
["YKZ","Buttonville Municipal Airport","CA",43.862201690699997,-79.370002746599994]
["YPJ","Aupaluk Airport","CA",59.296699523900003,-69.599700927699999]
["YLB","Lac La Biche Airport","CA",54.7703018188,-112.0319976807]
["YLC","Kimmirut Airport","CA",62.849998474099998,-69.883300781200006]
["YLD","Chapleau Airport","CA",47.819999694800003,-83.346702575699993]
["YLH","Lansdowne House Airport","CA",52.195598602300002,-87.9341964722]
["YLJ","Meadow Lake Airport","CA",54.1253013611,-108.52300262449999]
["YSG","Lutselk'e Airport","CA",62.418300628700003,-110.6819992065]
["YLL","Lloydminster Airport","CA",53.309200286900001,-110.0729980469]
["YLQ","La Tuque Airport","CA",47.409698486300002,-72.788902282699993]
["YLR","Leaf Rapids Airport","CA",56.513301849400001,-99.985298156699997]
["YLK","Yelahanka Air Force Station","IN",13.1354999542,77.606002807600007]
["YLT","Alert Airport","CA",82.517799377399996,-62.280601501500001]
["XGR","Kangiqsualujjuaq (Georges River) Airport","CA",58.711399078399999,-65.992797851600002]
["YLW","Kelowna Airport","CA",49.9561004639,-119.37799835209999]
["YMA","Mayo Airport","CA",63.616401672400002,-135.86799621579999]
["YME","Matane Airport","CA",48.856899261499997,-67.453300476099997]
["YMG","Manitouwadge Airport","CA",49.083900451700003,-85.860603332500006]
["YMH","Mary's Harbour Airport","CA",52.302799224899999,-55.847198486300002]
["YMJ","Moose Jaw Air Vice Marshal C. M. McEwen Airport","CA",50.330299377400003,-105.5589981079]
["YML","Charlevoix Airport","CA",47.597499847400002,-70.223899841299996]
["YMM","Fort McMurray Airport","CA",56.653301239000001,-111.222000122]
["YMO","Moosonee Airport","CA",51.291099548299997,-80.607803344700002]
["YMT","Chapais Airport","CA",49.771900176999999,-74.528099060100004]
["YUD","Umiujaq Airport","CA",56.536098480200003,-76.518302917499994]
["YMW","Maniwaki Airport","CA",46.272800445599998,-75.990600585899998]
["YMX","Montreal International (Mirabel) Airport","CA",45.679500579799999,-74.038696289100002]
["YNA","Natashquan Airport","CA",50.189998626700003,-61.789199829099999]
["YNC","Wemindji Airport","CA",53.010601043699999,-78.8311004639]
["YND","Ottawa / Gatineau Airport","CA",45.521701812700002,-75.563598632799994]
["YNE","Norway House Airport","CA",53.958301544199998,-97.844200134299996]
["YNH","Hudsons Hope Airport","CA",56.035598754900001,-121.9759979248]
["YLY","Langley Airport","CA",49.1007995605,-122.6309967041]
["YNL","Points North Landing Airport","CA",58.276699066200003,-104.0820007324]
["YNM","Matagami Airport","CA",49.761699676500001,-77.802803039599993]
["YNN","Nejanilini Lake Airport","CA",59.487499237100003,-97.780296325699993]
["HZP","Fort Mackay / Horizon Airport","CA",57.381698608400001,-111.700996399]
["YOA","Ekati Airport","CA",64.698898315400001,-110.614997864]
["YOC","Old Crow Airport","CA",67.570602417000003,-139.8390045166]
["YOD","CFB Cold Lake","CA",54.404998779300001,-110.27899932859999]
["YOH","Oxford House Airport","CA",54.933300018300002,-95.278900146500007]
["YOJ","High Level Airport","CA",58.621398925800001,-117.1650009155]
["YOO","Oshawa Airport","CA",43.922798156699997,-78.894996643100001]
["YOP","Rainbow Lake Airport","CA",58.491401672400002,-119.40799713129999]
["YOS","Owen Sound / Billy Bishop Regional Airport","CA",44.590301513699998,-80.837501525899995]
["YOW","Ottawa Macdonald-Cartier International Airport","CA",45.322498321499999,-75.669197082500006]
["YPA","Prince Albert Glass Field","CA",53.214199066200003,-105.672996521]
["YPC","Paulatuk (Nora Aliqatchialuk Ruben) Airport","CA",69.3608381154,-124.075469971]
["YPS","Port Hawkesbury Airport","CA",45.656700134300003,-61.368099212600001]
["YPE","Peace River Airport","CA",56.226898193399997,-117.4469985962]
["YPG","Southport Airport","CA",49.903099060099997,-98.273902893100001]
["YPH","Inukjuak Airport","CA",58.471900939900003,-78.076896667499994]
["YPL","Pickle Lake Airport","CA",51.446399688699998,-90.214202880900004]
["YPM","Pikangikum Airport","CA",51.819698333700003,-93.973297119099996]
["YPN","Port Menier Airport","CA",49.836399078399999,-64.288597106899999]
["YPO","Peawanuck Airport","CA",54.9880981445,-85.443298339799995]
["YPQ","Peterborough Airport","CA",44.229999542199998,-78.363296508800005]
["YPR","Prince Rupert Airport","CA",54.286098480200003,-130.44500732419999]
["YPW","Powell River Airport","CA",49.834201812700002,-124.5]
["YPX","Puvirnituq Airport","CA",60.0505981445,-77.286903381299993]
["YPY","Fort Chipewyan Airport","CA",58.767200469999999,-111.1169967651]
["YPZ","Burns Lake Airport","CA",54.376399993900002,-125.9509963989]
["YQA","Muskoka Airport","CA",44.974700927699999,-79.303298950200002]
["YQB","Quebec Jean Lesage International Airport","CA",46.791099548299997,-71.393302917499994]
["YQD","The Pas Airport","CA",53.9714012146,-101.091003418]
["YQF","Red Deer Regional Airport","CA",52.182201385500001,-113.89399719239999]
["YQG","Windsor Airport","CA",42.275600433299999,-82.955596923800002]
["YQH","Watson Lake Airport","CA",60.116401672400002,-128.82200622560001]
["YQI","Yarmouth Airport","CA",43.826900482200003,-66.088096618700007]
["YQK","Kenora Airport","CA",49.7882995605,-94.3630981445]
["YQL","Lethbridge County Airport","CA",49.630298614499999,-112.80000305199999]
["YQM","Greater Moncton International Airport","CA",46.112201690699997,-64.678596496599994]
["YQN","Nakina Airport","CA",50.182800293,-86.696403503400006]
["YQQ","Comox Airport","CA",49.710800170900001,-124.8870010376]
["YQR","Regina International Airport","CA",50.431900024400001,-104.6660003662]
["YQS","St Thomas Municipal Airport","CA",42.770000457800002,-81.110801696799996]
["YQT","Thunder Bay Airport","CA",48.371898651099997,-89.323898315400001]
["YQU","Grande Prairie Airport","CA",55.179698944099997,-118.885002136]
["YQV","Yorkton Municipal Airport","CA",51.264701843300003,-102.4619979858]
["YQW","North Battleford Airport","CA",52.769199371299997,-108.2440032959]
["YQX","Gander International Airport","CA",48.936901092500001,-54.568099975599999]
["YQY","Sydney / J.A. Douglas McCurdy Airport","CA",46.161399841300003,-60.047798156699997]
["YQZ","Quesnel Airport","CA",53.026100158699997,-122.5100021362]
["YRA","Rae Lakes Airport","CA",64.116096496599994,-117.3099975586]
["YRB","Resolute Bay Airport","CA",74.716903686500004,-94.969398498499999]
["YRI","Riviere-du-Loup Airport","CA",47.764400482200003,-69.584701538100006]
["YRJ","Roberval Airport","CA",48.520000457800002,-72.265602111800007]
["YRL","Red Lake Airport","CA",51.0668983459,-93.793098449699997]
["YRM","Rocky Mountain House Airport","CA",52.429698944099997,-114.90399932859999]
["YRO","Ottawa / Rockcliffe Airport","CA",45.460300445599998,-75.646102905299998]
["YRP","Ottawa / Carp Airport","CA",45.319198608400001,-76.022201538100006]
["YRQ","Trois-Rivieres Airport","CA",46.352798461900001,-72.679397582999997]
["YRS","Red Sucker Lake Airport","CA",54.1671981812,-93.5571975708]
["YRT","Rankin Inlet Airport","CA",62.811401367199998,-92.115798950200002]
["YRV","Revelstoke Airport","CA",50.9667015076,-118.182998657]
["YSB","Sudbury Airport","CA",46.625,-80.798896789599993]
["YSC","Sherbrooke Airport","CA",45.438598632800002,-71.691398620599998]
["YSE","Squamish Airport","CA",49.781700134300003,-123.1620025635]
["YSF","Stony Rapids Airport","CA",59.2503013611,-105.841003418]
["YSH","Smiths Falls-Montague (Russ Beach) Airport","CA",44.945800781300001,-75.940597534199995]
["YSJ","Saint John Airport","CA",45.316101074199999,-65.890296935999999]
["YSK","Sanikiluaq Airport","CA",56.537799835199998,-79.2466964722]
["YSL","St Leonard Airport","CA",47.157501220699999,-67.834701538100006]
["YSM","Fort Smith Airport","CA",60.0203018188,-111.9619979858]
["YCM","Niagara District Airport","CA",43.191699981699998,-79.171699523900003]
["YSP","Marathon Airport","CA",48.755298614499999,-86.344398498499999]
["YST","St. Theresa Point Airport","CA",53.845600128199997,-94.851898193400004]
["YSU","Summerside Airport","CA",46.440601348900003,-63.833599090600003]
["YSY","Sachs Harbour (David Nasogaluak Jr. Saaryuaq) Airport","CA",71.993896484399997,-125.24299621599999]
["YTA","Pembroke Airport","CA",45.864398956300001,-77.251701354999994]
["YTE","Cape Dorset Airport","CA",64.230003356899999,-76.526702880900004]
["YTF","Alma Airport","CA",48.508899688699998,-71.641899108900006]
["YTH","Thompson Airport","CA",55.801101684599999,-97.864196777299995]
["YTL","Big Trout Lake Airport","CA",53.817798614499999,-89.896896362299998]
["YTQ","Tasiujaq Airport","CA",58.667800903299998,-69.955802917499994]
["YTR","CFB Trenton","CA",44.118900299099998,-77.528099060100004]
["YTS","Timmins/Victor M. Power","CA",48.569698333700003,-81.376701354999994]
["YTZ","Billy Bishop Toronto City Centre Airport","CA",43.627498626700003,-79.396202087399999]
["YUB","Tuktoyaktuk Airport","CA",69.433296203599994,-133.02600097659999]
["YUL","Montreal / Pierre Elliott Trudeau International Airport","CA",45.470600128199997,-73.740798950200002]
["YUT","Repulse Bay Airport","CA",66.521400451700003,-86.224700927699999]
["YUX","Hall Beach Airport","CA",68.776100158700004,-81.243598938000005]
["YUY","Rouyn Noranda Airport","CA",48.2061004639,-78.835601806599996]
["YVB","Bonaventure Airport","CA",48.071098327599998,-65.460296630900004]
["YVC","La Ronge Airport","CA",55.151401519799997,-105.2620010376]
["YVG","Vermilion Airport","CA",53.355800628700003,-110.8239974976]
["YVE","Vernon Airport","CA",50.248100280800003,-119.3310012817]
["YVM","Qikiqtarjuaq Airport","CA",67.545799255399999,-64.031402587900004]
["YVO","Val-d'Or Airport","CA",48.053298950200002,-77.782798767100005]
["YVP","Kuujjuaq Airport","CA",58.0960998535,-68.426902771000002]
["YVQ","Norman Wells Airport","CA",65.281600952100007,-126.797996521]
["YVR","Vancouver International Airport","CA",49.193901062000002,-123.1839981079]
["YVT","Buffalo Narrows Airport","CA",55.841899871800003,-108.417999268]
["YVV","Wiarton Airport","CA",44.745800018300002,-81.107200622600004]
["YVZ","Deer Lake Airport","CA",52.655799865699997,-94.061401367200006]
["YWA","Petawawa Airport","CA",45.952201843300003,-77.319198608400001]
["YFJ","Wekweeti Airport","CA",64.1908035278,-114.077003479]
["YWG","Winnipeg / James Armstrong Richardson International Airport","CA",49.909999847400002,-97.239898681599996]
["YWJ","Deline Airport","CA",65.211097717300007,-123.4359970093]
["YWK","Wabush Airport","CA",52.921901702900001,-66.864402771000002]
["YWL","Williams Lake Airport","CA",52.1831016541,-122.0540008545]
["YWP","Webequie Airport","CA",52.959393397500001,-87.374868392899998]
["YWY","Wrigley Airport","CA",63.209400176999999,-123.43699646]
["YXC","Cranbrook Airport","CA",49.610801696800003,-115.7819976807]
["YXD","Edmonton City Centre (Blatchford Field) Airport","CA",53.572498321499999,-113.52100372300001]
["YXE","Saskatoon John G. Diefenbaker International Airport","CA",52.170799255399999,-106.6999969482]
["YXH","Medicine Hat Airport","CA",50.018901825,-110.72100067140001]
["YXJ","Fort St John Airport","CA",56.2380981445,-120.7399978638]
["YXK","Rimouski Airport","CA",48.478099823000001,-68.496902465800005]
["YXL","Sioux Lookout Airport","CA",50.113899230999998,-91.905296325699993]
["YXN","Whale Cove Airport","CA",62.240001678500001,-92.598098754899993]
["YXP","Pangnirtung Airport","CA",66.144996643100001,-65.713600158700004]
["YXQ","Beaver Creek Airport","CA",62.410301208500002,-140.86700439449999]
["YXR","Earlton (Timiskaming Regional) Airport","CA",47.697400654600003,-79.847345352199994]
["YXS","Prince George Airport","CA",53.889400482200003,-122.6790008545]
["YXT","Terrace Airport","CA",54.468498230000002,-128.57600402829999]
["YXU","London Airport","CA",43.035598754900001,-81.153900146500007]
["YXX","Abbotsford Airport","CA",49.025299072300001,-122.361000061]
["YXY","Whitehorse / Erik Nielsen International Airport","CA",60.709598541299997,-135.06700134299999]
["YXZ","Wawa Airport","CA",47.9667015076,-84.786697387700002]
["YYB","North Bay Airport","CA",46.363601684599999,-79.422798156699997]
["YYC","Calgary International Airport","CA",51.113899230999998,-114.0199966431]
["YYD","Smithers Airport","CA",54.824699401899998,-127.1829986572]
["YYE","Fort Nelson Airport","CA",58.836399078399999,-122.5970001221]
["YYF","Penticton Airport","CA",49.463100433299999,-119.60199737550001]
["YYG","Charlottetown Airport","CA",46.290000915500002,-63.121101379400002]
["YYH","Taloyoak Airport","CA",69.546699523900003,-93.576698303200004]
["YYJ","Victoria International Airport","CA",48.646900176999999,-123.4260025024]
["YYL","Lynn Lake Airport","CA",56.863899230999998,-101.0759963989]
["YYM","Cowley Airport","CA",49.636398315400001,-114.09400177000001]
["YYN","Swift Current Airport","CA",50.291900634800001,-107.691001892]
["YYQ","Churchill Airport","CA",58.739200592000003,-94.065002441399997]
["YYR","Goose Bay Airport","CA",53.319198608400001,-60.425800323499999]
["YYT","St. John's International Airport","CA",47.618598937999998,-52.751899719199997]
["YYU","Kapuskasing Airport","CA",49.413898467999999,-82.467498779300001]
["YYW","Armstrong Airport","CA",50.290298461900001,-88.909698486300002]
["YYY","Mont Joli Airport","CA",48.608600616499999,-68.208099365199999]
["YYZ","Lester B. Pearson International Airport","CA",43.677200317400001,-79.630599975600006]
["YZD","Downsview Airport","CA",43.742500305199997,-79.465599060100004]
["YZE","Gore Bay Manitoulin Airport","CA",45.885299682599999,-82.5678024292]
["YZF","Yellowknife Airport","CA",62.462799072300001,-114.4400024414]
["YZG","Salluit Airport","CA",62.179401397699998,-75.667198181200007]
["YZH","Slave Lake Airport","CA",55.293098449699997,-114.777000427]
["YZP","Sandspit Airport","CA",53.254299163799999,-131.813995361]
["YZR","Chris Hadfield Airport","CA",42.999401092500001,-82.308898925799994]
["YZS","Coral Harbour Airport","CA",64.193298339799995,-83.359397888199993]
["YZT","Port Hardy Airport","CA",50.680599212600001,-127.3669967651]
["YZU","Whitecourt Airport","CA",54.143901825,-115.7870025635]
["YZV","Sept-Iles Airport","CA",50.223300933799997,-66.265602111800007]
["YZW","Teslin Airport","CA",60.172798156699997,-132.74299621579999]
["YZX","CFB Greenwood","CA",44.984401702900001,-64.916900634800001]
["YZY","Mackenzie Airport","CA",55.304401397699998,-123.13200378400001]
["ZAC","York Landing Airport","CA",56.089401245099999,-96.089202880900004]
["YSN","Salmon Arm Airport","CA",50.682800293,-119.22899627690001]
["YDT","Burlington Executive","CA",43.441453151499999,-79.850102663000001]
["ZBD","Vancouver / Boundary Bay Airport","CA",49.074199676500001,-123.01200103799999]
["ILF","Ilford Airport","CA",56.061401367199998,-95.613899231000005]
["ZBF","Bathurst Airport","CA",47.629699707,-65.738899231000005]
["ZBM","Bromont (Roland Desourdy) Airport","CA",45.290798187299998,-72.741401672400002]
["ZEE","Kelsey Airport","CA",56.037498474099998,-96.509696960400007]
["ZEM","Eastmain River Airport","CA",52.226398467999999,-78.522499084499998]
["ZFA","Faro Airport","CA",62.207500457800002,-133.37600708010001]
["ZFD","Fond-Du-Lac Airport","CA",59.334400176999999,-107.1819992065]
["ZFG","Pukatawagan Airport","CA",55.749198913599997,-101.2659988403]
["ZFM","Fort Mcpherson Airport","CA",67.407501220699999,-134.86099243160001]
["ZFN","Tulita Airport","CA",64.909698486300002,-125.5729980469]
["ZGF","Grand Forks Airport","CA",49.015598297099999,-118.4309997559]
["ZGI","Gods River Airport","CA",54.839698791499998,-94.078598022500003]
["ZGR","Little Grand Rapids Airport","CA",52.045600891100001,-95.465797424300007]
["ZHP","High Prairie Airport","CA",55.3936004639,-116.4749984741]
["ZJG","Jenpeg Airport","CA",54.518901825,-98.046096801800005]
["ZJN","Swan River Airport","CA",52.1206016541,-101.236000061]
["ZKE","Kashechewan Airport","CA",52.282501220699999,-81.677803039599993]
["YTD","Thicket Portage Airport","CA",55.318901062000002,-97.707801818799993]
["MSA","Muskrat Dam Airport","CA",53.441398620599998,-91.762802124000004]
["ZMH","South Cariboo Region / 108 Mile Airport","CA",51.736099243200002,-121.333000183]
["PIW","Pikwitonei Airport","CA",55.588901519799997,-97.164199829099999]
["ZMT","Masset Airport","CA",54.027500152599998,-132.125]
["ZNG","Poplar River Airport","CA",53,-97.266700744600001]
["ZPB","Sachigo Lake Airport","CA",53.891101837199997,-92.196403503400006]
["WPC","Pincher Creek Airport","CA",49.520599365199999,-113.99700164790001]
["ZPO","Pinehouse Lake Airport","CA",55.528099060099997,-106.582000732]
["ZRJ","Round Lake (Weagamow Lake) Airport","CA",52.943599700900002,-91.312797546400006]
["ZSJ","Sandy Lake Airport","CA",53.064201355000002,-93.344398498499999]
["ZSN","Stendal-Borstel Airport","DE",52.628887176500001,11.818611145]
["ZST","Stewart Airport","CA",55.935410447999999,-129.98243451100001]
["YDV","Bloodvein River Airport","CA",51.7832984924,-96.699996948199995]
["ZTM","Shamattawa Airport","CA",55.865600585899998,-92.081398010300006]
["ZUC","Ignace Municipal Airport","CA",49.429698944099997,-91.717796325699993]
["ZUM","Churchill Falls Airport","CA",53.561901092500001,-64.1063995361]
["ZWH","Lac Brochet Airport","CA",58.617500305199997,-101.46900177000001]
["ZWL","Wollaston Lake Airport","CA",58.106899261499997,-103.17199707029999]
["QLD","Blida Airport","DZ",36.503601074199999,2.8141698837]
["BUJ","Bou Saada Airport","DZ",35.332500457800002,4.2063899039999999]
["BJA","Soummam Airport","DZ",36.712001800499998,5.0699200629999996]
["ALG","Houari Boumediene Airport","DZ",36.691001892099997,3.2154099940999998]
["DJG","Djanet Inedbirene Airport","DZ",24.292800903300002,9.4524402617999996]
["QFD","Boufarik Airport","DZ",36.545799255399999,2.8761100768999999]
["VVZ","Illizi Takhamalt Airport","DZ",26.723499298099998,8.6226501464999998]
["QSF","Ain Arnat Airport","DZ",36.178100585899998,5.3244900703000004]
["TMR","Aguenar – Hadj Bey Akhamok Airport","DZ",22.8115005493,5.4510798453999998]
["GJL","Jijel Ferhat Abbas Airport","DZ",36.795101165799998,5.8736100197000001]
["MZW","Mecheria Airport","DZ",33.535900116000001,-0.2423530072]
["QZN","Relizane Airport","DZ",35.752201080299997,0.62627202270000004]
["AAE","Annaba Airport","DZ",36.822200775100001,7.8091697693000004]
["CZL","Mohamed Boudiaf International Airport","DZ",36.276000976600002,6.6203899383999998]
["TEE","Cheikh Larbi Tebessi Airport","DZ",35.431598663300001,8.1207199097]
["BLJ","Batna Airport","DZ",35.752101898200003,6.3085899352999997]
["HRM","Hassi R'Mel Airport","DZ",32.930400848399998,3.3115398884]
["QDJ","Tsletsi Airport","DZ",34.665700000000001,3.351]
["TID","Bou Chekif Airport","DZ",35.3410987854,1.4631500244]
["TIN","Tindouf Airport","DZ",27.700399398799998,-8.1670999526999992]
["QAS","Ech Cheliff Airport","DZ",36.212699890099998,1.3317699432000001]
["TAF","Tafaraoui Airport","DZ",35.542400360099997,-0.53227800130000003]
["TLM","Zenata – Messali El Hadj Airport","DZ",35.016700744600001,-1.4500000476999999]
["ORN","Es Senia Airport","DZ",35.623901367199998,-0.62118297820000001]
["CBH","Bechar Boudghene Ben Ali Lotfi Airport","DZ",31.645700454699998,-2.2698600292000002]
["BFW","Sidi Bel Abbes Airport","DZ",35.171798706099999,-0.59327501059999999]
["MUW","Ghriss Airport","DZ",35.207698821999998,0.147141993]
["EBH","El Bayadh Airport","DZ",33.721666666700003,1.0925]
["INF","In Guezzam Airport","DZ",19.5669994354,5.75]
["BMW","Bordj Badji Mokhtar Airport","DZ",21.375,0.92388898129999997]
["AZR","Touat Cheikh Sidi Mohamed Belkebir Airport","DZ",27.837600708,-0.1864140034]
["BSK","Biskra Airport","DZ",34.793300628700003,5.7382302284]
["ELG","El Golea Airport","DZ",30.5713005066,2.8595900535999998]
["GHA","Noumerat - Moufdi Zakaria Airport","DZ",32.384101867699997,3.7941100596999999]
["HME","Oued Irara Airport","DZ",31.673000335699999,6.1404399871999997]
["INZ","In Salah Airport","DZ",27.2509994507,2.5120201111]
["TGR","Touggourt Sidi Madhi Airport","DZ",33.067798614499999,6.0886697768999998]
["LOO","Laghouat Airport","DZ",33.764400482200003,2.9283399582]
["ELU","Guemar Airport","DZ",33.511398315400001,6.7767901421000003]
["TMX","Timimoun Airport","DZ",29.237100601200002,0.27603301409999997]
["OGX","Ain el Beida Airport","DZ",31.9172000885,5.4127798079999998]
["IAM","In Amenas Airport","DZ",28.051500320399999,9.6429100037000008]
["COO","Cadjehoun Airport","BJ",6.3572301864999998,2.3843500614000002]
["DJA","Djougou Airport","BJ",9.6920833332999994,1.6377777778]
["KDC","Kandi Airport","BJ",11.1330003738,2.9330000877]
["NAE","Natitingou Airport","BJ",10.3170003891,1.3830000162]
["PKO","Parakou Airport","BJ",9.3576898575000005,2.6096799374000001]
["SVF","Save Airport","BJ",8.0181703568000007,2.4645800591000002]
["XKY","Kaya Airport","BF",13.0670003891,-1.1000000238000001]
["OUG","Ouahigouya Airport","BF",13.5670003891,-2.4170000552999999]
["XDJ","Djibo Airport","BF",14.100000381499999,-1.6330000162]
["XLU","Leo Airport","BF",11.100000381499999,-2.0999999046000002]
["PUP","Po Airport","BF",11.149999618500001,-1.1499999761999999]
["XBO","Boulsa Airport","BF",12.649999618500001,-0.56699997189999995]
["XBG","Bogande Airport","BF",12.9829998016,-0.16699999569999999]
["DIP","Diapaga Airport","BF",12.050000190700001,1.7829999924]
["DOR","Dori Airport","BF",14.032999992400001,-3.2999999799999999E-2]
["FNG","Fada N'gourma Airport","BF",12.032999992400001,0.34999999399999998]
["XGG","Gorom-Gorom Airport","BF",14.449999809299999,-0.23299999539999999]
["XKA","Kantchari Airport","BF",12.467000007599999,1.5]
["TMQ","Tambao Airport","BF",14.800000190700001,5.0000000699999998E-2]
["XPA","Pama Airport","BF",11.25,0.69999998809999997]
["ARL","Arly Airport","BF",11.597000122100001,1.4830000401000001]
["XSE","Sebba Airport","BF",13.449999809299999,0.51700001959999997]
["TEG","Tenkodogo Airport","BF",11.800000190700001,-0.36700001360000001]
["XZA","Zabre Airport","BF",11.166999816900001,-0.61699998379999998]
["OUA","Ouagadougou Airport","BF",12.353199958799999,-1.5124200583]
["BNR","Banfora Airport","BF",10.6829996109,-4.7170000076000003]
["DGU","Dedougou Airport","BF",12.4589996338,-3.4900000095000001]
["XGA","Gaoua Airport","BF",10.299200058,-3.2508299351000001]
["XNU","Nouna Airport","BF",12.75,-3.8670001030000001]
["BOY","Bobo Dioulasso Airport","BF",11.1600999832,-4.3309698105000001]
["TUQ","Tougan Airport","BF",13.0670003891,-3.0669999123]
["XDE","Diebougou Airport","BF",10.949999809299999,-3.25]
["XAR","Aribinda Airport","BF",14.217000007599999,-0.88300001620000002]
["ACC","Kotoka International Airport","GH",5.6051898002999998,-0.1667860001]
["TML","Tamale Airport","GH",9.5571899414000008,-0.86321401600000003]
["KMS","Kumasi Airport","GH",6.7145600318999996,-1.5908199548999999]
["NYI","Sunyani Airport","GH",7.3618302345000002,-2.3287599086999999]
["TKD","Takoradi Airport","GH",4.8960599899000004,-1.7747600079000001]
["ABJ","Port Bouet Airport","CI",5.2613902092,-3.9262900352000001]
["OGO","Abengourou Airport","CI",6.7155599594000002,-3.470279932]
["BXI","Boundiali Airport","CI",9.5329999924000006,-6.4670000076000003]
["BYK","Bouake Airport","CI",7.7388000487999999,-5.0736699103999996]
["BQO","Bouna Airport","CI",9.2775001526,-3.0252799987999999]
["BDK","Soko Airport","CI",8.0172195434999995,-2.7619400023999998]
["DIM","Dimbokro Airport","CI",6.6516699791000002,-4.6405601500999998]
["DJO","Daloa Airport","CI",6.7928099631999999,-6.4731898308]
["FEK","Ferkessedougou Airport","CI",9.6000003814999992,-5.1999998093000004]
["GGN","Gagnoa Airport","CI",6.1329998970000004,-5.9499998093000004]
["GGO","Guiglo Airport","CI",6.5249900818000004,-7.4786100388000003]
["BBV","Nero-Mer Airport","CI",4.6434130669,-6.9239616393999999]
["HGO","Korhogo Airport","CI",9.3871803283999995,-5.5566601753000002]
["MJC","Man Airport","CI",7.2720699309999999,-7.5873599051999996]
["KEO","Odienne Airport","CI",9.5,-7.5669999123]
["OFI","Ouango Fitini Airport","CI",9.6000003814999992,-4.0500001906999996]
["SEO","Seguela Airport","CI",7.9683299065000002,-6.7108302116000003]
["SPY","San Pedro Airport","CI",4.7467198371999997,-6.6608200072999999]
["ZSS","Sassandra Airport","CI",4.9283299445999997,-6.1327800751000003]
["TXU","Tabou Airport","CI",4.4378094673000001,-7.3627281188999998]
["ASK","Yamoussoukro Airport","CI",6.9031701088000004,-5.3655800819000001]
["ABV","Nnamdi Azikiwe International Airport","NG",9.0067901610999996,7.2631697654999998]
["AKR","Akure Airport","NG",7.2467398643000003,5.3010101318]
["ABB","Asaba International Airport","NG",6.2033333332999998,6.6588888889]
["BNI","Benin Airport","NG",6.3169798851000003,5.5995001792999997]
["CBQ","Margaret Ekpo International Airport","NG",4.9760198593,8.3472003936999997]
["ENU","Akanu Ibiam International Airport","NG",6.4742698669000003,7.5619602202999996]
["GMO","Gombe Lawanti International Airport","NG",10.2983333333,10.896388888900001]
["QUS","Gusau Airport","NG",12.171699523899999,6.6961097716999998]
["IBA","Ibadan Airport","NG",7.3624601364000002,3.9783298969000001]
["ILR","Ilorin International Airport","NG",8.4402103424000003,4.4939198494000001]
["QOW","Sam Mbakwe International Airport","NG",5.4270601272999999,7.2060298920000001]
["JOS","Yakubu Gowon Airport","NG",9.6398296355999999,8.8690500259]
["KAD","Kaduna Airport","NG",10.696000099200001,7.3201098442000001]
["KAN","Mallam Aminu International Airport","NG",12.0475997925,8.5246200561999999]
["MIU","Maiduguri International Airport","NG",11.855299949600001,13.0809001923]
["MDI","Makurdi Airport","NG",7.7038798332000002,8.6139402389999997]
["LOS","Murtala Muhammed International Airport","NG",6.5773701667999998,3.3211600780000001]
["MXJ","Minna Airport","NG",9.6521701813000007,6.4622597694000001]
["PHC","Port Harcourt International Airport","NG",5.0154900550999999,6.9495902060999999]
["SKO","Sadiq Abubakar III International Airport","NG",12.916299819900001,5.2071900368000001]
["NBE","Enfidha Zine El Abidine Ben Ali International Airport","TN",36.075833000000003,10.438611]
["YOL","Yola Airport","NG",9.2575502396000005,12.430399894700001]
["ZAR","Zaria Airport","NG",11.130200386,7.6858100891000003]
["MFQ","Maradi Airport","NE",13.5024995804,7.1267499923999997]
["NIM","Diori Hamani International Airport","NE",13.4814996719,2.1836099624999998]
["THZ","Tahoua Airport","NE",14.8756999969,5.2653598785]
["AJY","Mano Dayak International Airport","NE",16.965999603299998,8.0001096725000007]
["RLT","Arlit Airport","NE",18.7903995514,7.3659501075999998]
["ZND","Zinder Airport","NE",13.7790002823,8.9837598800999992]
["TBJ","Tabarka 7 Novembre Airport","TN",36.979999542199998,8.8769397736000002]
["MIR","Monastir Habib Bourguiba International Airport","TN",35.758098602300002,10.754699707]
["TUN","Tunis Carthage International Airport","TN",36.851001739499999,10.2271995544]
["OIZ","Sidi Ahmed Air Base","TN",37.245399475100001,9.7914495467999991]
["GAF","Gafsa Ksar International Airport","TN",34.422000885000003,8.8225002288999992]
["GAE","Gabes Matmata International Airport","TN",33.876899719199997,10.1033000946]
["DJE","Djerba Zarzis International Airport","TN",33.875,10.775500297500001]
["EBM","El Borma Airport","TN",31.704299926800001,9.2546195983999997]
["SFA","Sfax Thyna International Airport","TN",34.717998504599997,10.690999984699999]
["TOE","Tozeur Nefta International Airport","TN",33.939701080299997,8.1105604172000003]
["LRL","Niamtougou International Airport","TG",9.7673301696999992,1.0912499428]
["LFW","Lome-Tokoin Airport","TG",6.1656098365999998,1.2545100451]
["ANR","Antwerp International Airport (Deurne)","BE",51.189399719199997,4.4602799415999996]
["BRU","Brussels Airport","BE",50.901401519799997,4.4844398499000002]
["CRL","Brussels South Charleroi Airport","BE",50.459201812700002,4.4538202285999997]
["KJK","Wevelgem Airport","BE",50.817199707,3.2047200202999999]
["LGG","Liege Airport","BE",50.637401580800002,5.4432201385000001]
["QNM","Suarlee Airport","BE",50.487998962399999,4.7689199448000004]
["OST","Ostend-Bruges International Airport","BE",51.198898315400001,2.8622200488999998]
["QHA","Hasselt Airport","BE",50.970001220699999,5.3750700950999999]
["OBL","Oostmalle Air Base","BE",51.264701843300003,4.7533302306999996]
["AOC","Altenburg-Nobitz Airport","DE",50.981945037800003,12.506388664199999]
["HDF","Heringsdorf Airport","DE",53.8787002563,14.152299880999999]
["ZHZ","Halle-Oppin Airport","DE",51.552223205600001,12.053889274599999]
["IES","Riesa-Gohlis Airport","DE",51.293609619100003,13.3561105728]
["REB","Rechlin-Larz Airport","DE",53.306388855000002,12.752222061199999]
["CSO","Cochstedt Airport","DE",51.8563995361,11.420299529999999]
["BBH","Barth Airport","DE",54.337501525900002,12.699700355499999]
["ZMG","Magdeburg Airport","DE",52.073612213099999,11.6263885498]
["CBU","Cottbus-Drewitz Airport","DE",51.8894424438,14.531944274900001]
["GTI","Rugen Airport","DE",54.383331298800002,13.3255558014]
["KOQ","Kothen Airport","DE",51.721111297599997,11.9527778625]
["PEF","Peenemunde Airport","DE",54.157779693599998,13.7744436264]
["BER","Berlin Brandenburg Airport","DE",52.366667,13.503333]
["DRS","Dresden Airport","DE",51.132801055900003,13.767200470000001]
["ERF","Erfurt Airport","DE",50.979801178000002,10.9581003189]
["FRA","Frankfurt am Main International Airport","DE",50.026401519799997,8.5431299210000002]
["FMO","Munster Osnabruck Airport","DE",52.134601592999999,7.6848301888000004]
["HAM","Hamburg Airport","DE",53.630401611300002,9.9882297516000005]
["THF","Berlin Tempelhof Airport","DE",52.473610999999998,13.401667]
["CGN","Cologne Bonn Airport","DE",50.865898132300003,7.1427397727999997]
["DUS","Dusseldorf International Airport","DE",51.289501190199999,6.7667798996000004]
["MUC","Munich International Airport","DE",48.353801727300002,11.786100387599999]
["NUE","Nuremberg Airport","DE",49.4986991882,11.0669002533]
["LEJ","Leipzig Halle Airport","DE",51.432399749799998,12.2416000366]
["SCN","Saarbrucken Airport","DE",49.214599609399997,7.1095099449000001]
["STR","Stuttgart Airport","DE",48.689899444600002,9.2219600676999995]
["TXL","Berlin-Tegel International Airport","DE",52.559700012199997,13.287699699399999]
["HAJ","Hannover Airport","DE",52.461101532000001,9.6850795745999996]
["BRE","Bremen Airport","DE",53.0475006104,8.7866697310999999]
["QEF","Frankfurt-Egelsbach Airport","DE",49.959999084499998,8.6458330153999992]
["HHN","Frankfurt-Hahn Airport","DE",49.948699951199998,7.2638897896000003]
["MHG","Mannheim-City Airport","DE",49.473056793200001,8.5141668320000008]
["QMZ","Mainz-Finthen Airport","DE",49.967498779300001,8.1472215652000006]
["EIB","Eisenach-Kindel Airport","DE",50.992778778100003,10.4727783203]
["SGE","Siegerland Airport","DE",50.707698821999998,8.0829696655000003]
["XFW","Hamburg-Finkenwerder Airport","DE",53.535278320300002,9.8355560302999994]
["KEL","Kiel-Holtenau Airport","DE",54.379444122300001,10.145277976999999]
["LBC","Lubeck Blankensee Airport","DE",53.805400848399998,10.719200134299999]
["EUM","Neumunster Airport","DE",54.079444885299999,9.9413890839000008]
["FMM","Memmingen Allgau Airport","DE",47.988800048800002,10.2395000458]
["AAH","Aachen-Merzbruck Airport","DE",50.823055267299999,6.1863889694000003]
["BNJ","Bonn-Hangelar Airport","DE",50.768890380899997,7.1633329391]
["ZCA","Arnsberg-Menden Airport","DE",51.4838905334,7.8983330726999998]
["ESS","Essen Mulheim Airport","DE",51.402301788300001,6.9373297690999998]
["BFE","Bielefeld Airport","DE",51.964721679699998,8.5444440842000002]
["ZOJ","Marl-Loemuhle Airport","DE",51.647201538099999,7.1633300781000004]
["MGL","Monchengladbach Airport","DE",51.230278015099998,6.5044441222999998]
["PAD","Paderborn Lippstadt Airport","DE",51.614101409900002,8.6163196564]
["NRN","Niederrhein Airport","DE",51.602401733400001,6.1421699523999997]
["DTM","Dortmund Airport","DE",51.5182991028,7.6122398376999998]
["AGB","Augsburg Airport","DE",48.425277710000003,10.9316673279]
["OBF","Oberpfaffenhofen Airport","DE",48.081401825,11.283100128199999]
["RBM","Straubing Airport","DE",48.900833129900001,12.516667366]
["FDH","Friedrichshafen Airport","DE",47.671298980700001,9.5114898682]
["FRF","Oschersleben Airport","DE",52.038055419899997,11.2055559158]
["SZW","Schwerin Parchim Airport","DE",53.426998138400002,11.783399581899999]
["BYU","Bayreuth Airport","DE",49.9850006104,11.640000343300001]
["URD","Burg Feuerstein Airport","DE",49.794166564900003,11.133610725400001]
["QOB","Ansbach-Petersdorf Airport","DE",49.361110687299998,10.6694440842]
["HOQ","Hof-Plauen Airport","DE",50.288612365699997,11.8563890457]
["BBJ","Bitburg Airport","DE",49.945278167700003,6.5650000571999998]
["ZNV","Koblenz-Winningen Airport","DE",50.325557708700003,7.5286111831999998]
["ZQF","Trier-Fohren Airport","DE",49.863887786900001,6.7874999045999997]
["ZQC","Speyer Airport","DE",49.304721832299997,8.4513893126999999]
["ZQW","Zweibrucken Airport","DE",49.209400176999999,7.4005599022000004]
["FKB","Karlsruhe Baden-Baden Airport","DE",48.779399871800003,8.0804996491000001]
["ZQL","Donaueschingen-Villingen Airport","DE",47.9733314514,8.5222215653000006]
["LHA","Lahr Airport","DE",48.369300842299999,7.8277201652999997]
["BWE","Braunschweig Wolfsburg Airport","DE",52.319198608400001,10.556099891700001]
["KSF","Kassel-Calden Airport","DE",51.408332824699997,9.3774995804000003]
["BRV","Bremerhaven Airport","DE",53.506942748999997,8.5727777481]
["XLW","Lemwerder Airport","DE",53.144699096700002,8.6244401931999999]
["EME","Emden Airport","DE",53.3911094666,7.2274999619000004]
["AGE","Wangerooge Airport","DE",53.782779693599998,7.9138889312999998]
["WVN","Wilhelmshaven-Mariensiel Airport","DE",53.502220153800003,8.0522222519]
["JUI","Juist Airport","DE",53.681110382100002,7.0558328629]
["LGO","Langeoog Airport","DE",53.742500305199997,7.4977779387999997]
["ZOW","Nordhorn-Lingen Airport","DE",52.457500457800002,7.1822218895000001]
["BMK","Borkum Airport","DE",53.596389770499997,6.7091670036000002]
["NOD","Norden-Norddeich Airport","DE",53.633056640600003,7.1902780533000001]
["VAC","Varrelbusch Airport","DE",52.908332824699997,8.0405559540000002]
["NRD","Norderney Airport","DE",53.706943512000002,7.2300000191000002]
["BMR","Baltrum Airport","DE",53.724723815899999,7.3733329772999996]
["HEI","Heide-Busum Airport","DE",54.153331756599997,8.9016666412000003]
["FLF","Flensburg-Schaeferhaus Airport","DE",54.773334503199997,9.3788890839000008]
["HGL","Helgoland-Dune Airport","DE",54.185279846199997,7.9158329963999998]
["QHU","Husum-Schwesing Airport","DE",54.509998321499999,9.1383333205999993]
["PSH","St. Peter-Ording Airport","DE",54.308887481699998,8.6869440078999993]
["GWT","Westerland Sylt Airport","DE",54.913200378399999,8.3404703139999992]
["OHR","Wyk auf Fohr Airport","DE",54.684444427499997,8.5283327103000008]
["KDL","Kardla Airport","EE",58.990798950200002,22.830699920699999]
["URE","Kuressaare Airport","EE",58.229900360099997,22.5095005035]
["EPU","Parnu Airport","EE",58.418998718300003,24.4727993011]
["TLL","Tallinn Airport","EE",59.4132995605,24.8327999115]
["TAY","Tartu Airport","EE",58.3074989319,26.690399169900001]
["ENF","Enontekio Airport","FI",68.362602233900006,23.424299240100002]
["QVE","Forssa Airport","FI",60.801898956300001,23.645599365199999]
["KEV","Halli Airport","FI",61.855998992899998,24.7866001129]
["HEM","Helsinki Malmi Airport","FI",60.254600524899999,25.042800903300002]
["HEL","Helsinki Vantaa Airport","FI",60.317199707,24.963300705000002]
["HYV","Hyvinkaa Airport","FI",60.654399871800003,24.881099700899998]
["KTQ","Kitee Airport","FI",62.166099548299997,30.073600768999999]
["IVL","Ivalo Airport","FI",68.607299804700006,27.405300140400001]
["JOE","Joensuu Airport","FI",62.662899017299999,29.607500076299999]
["JYV","Jyvaskyla Airport","FI",62.399501800499998,25.678300857499998]
["KAU","Kauhava Airport","FI",63.127101898200003,23.051399231000001]
["KEM","Kemi-Tornio Airport","FI",65.778701782200002,24.582099914600001]
["KAJ","Kajaani Airport","FI",64.285499572800006,27.692399978600001]
["KHJ","Kauhajoki Airport","FI",62.462501525900002,22.393100738499999]
["KOK","Kruunupyy Airport","FI",63.721199035600002,23.143100738499999]
["KAO","Kuusamo Airport","FI",65.987602233900006,29.2394008636]
["KTT","Kittila Airport","FI",67.700996398900003,24.846799850499998]
["KUO","Kuopio Airport","FI",63.007099151600002,27.797800064099999]
["QLF","Lahti Vesivehmaa Airport","FI",61.144199371299997,25.693500518800001]
["LPP","Lappeenranta Airport","FI",61.044601440400001,28.144399642900002]
["MHQ","Mariehamn Airport","FI",60.122200012199997,19.898199081400001]
["MIK","Mikkeli Airport","FI",61.686599731400001,27.2017993927]
["OUL","Oulu Airport","FI",64.930099487299998,25.354600906400002]
["POR","Pori Airport","FI",61.4617004395,21.7999992371]
["RVN","Rovaniemi Airport","FI",66.564796447800006,25.830400466899999]
["SVL","Savonlinna Airport","FI",61.943099975599999,28.945100784299999]
["SJY","Seinajoki Airport","FI",62.692100524899999,22.832300186200001]
["SOT","Sodankyla Airport","FI",67.394996643100001,26.619100570699999]
["TMP","Tampere-Pirkkala Airport","FI",61.414100646999998,23.604400634800001]
["TKU","Turku Airport","FI",60.514099121100003,22.262800216700001]
["UTI","Utti Air Base","FI",60.896400451700003,26.938400268599999]
["VAA","Vaasa Airport","FI",63.050701141399998,21.762199401899998]
["VRK","Varkaus Airport","FI",62.171100616499999,27.868600845300001]
["YLI","Ylivieska Airport","FI",64.0605010986,24.715999603299998]
["LHB","Bruntingthorpe Airport","GB",52.492971861999997,-1.1250901222]
["BFS","Belfast International Airport","GB",54.657501220699999,-6.2158298492000004]
["ENK","St Angelo Airport","GB",54.398899078399999,-7.6516699791000002]
["BHD","George Best Belfast City Airport","GB",54.618099212600001,-5.8724999428000002]
["LDY","City of Derry Airport","GB",55.042800903299998,-7.1611099242999998]
["BHX","Birmingham International Airport","GB",52.453899383500001,-1.7480299473000001]
["CVT","Coventry Airport","GB",52.369701385500001,-1.4797199965000001]
["GLO","Gloucestershire Airport","GB",51.894199371299997,-2.1672201157000002]
["ORM","Sywell Aerodrome","GB",52.305301666299997,-0.79305601120000002]
["NQT","Nottingham Airport","GB",52.919998168900001,-1.0791699885999999]
["GBA","Kemble Airport","GB",51.668098449699997,-2.0569400786999998]
["MAN","Manchester Airport","GB",53.3536987305,-2.2749500275000001]
["DSA","Robin Hood Doncaster Sheffield Airport","GB",53.480537810500003,-1.0106563568]
["UPV","Upavon Aerodrome","GB",51.286201477100001,-1.7820199727999999]
["LYE","RAF Lyneham","GB",51.505100250200002,-1.9934300184]
["DGX","MOD St. Athan","GB",51.404800414999997,-3.4357500075999998]
["YEO","RNAS Yeovilton","GB",51.009399414100002,-2.6388199329000002]
["CAL","Campbeltown Airport","GB",55.4371986389,-5.6863899231000001]
["EOI","Eday Airport","GB",59.190601348900003,-2.7722198963000002]
["FIE","Fair Isle Airport","GB",59.535800933799997,-1.6280599833]
["WHS","Whalsay Airport","GB",60.377498626700003,-0.92555600400000004]
["COL","Coll Airport","GB",56.601898193399997,-6.6177802086000002]
["NRL","North Ronaldsay Airport","GB",59.367500305199997,-2.4344398974999999]
["OBN","Oban Airport","GB",56.463500976600002,-5.3996701241]
["PPW","Papa Westray Airport","GB",59.351699829099999,-2.9002799987999999]
["SOY","Stronsay Airport","GB",59.155300140400001,-2.6413900851999998]
["NDY","Sanday Airport","GB",59.2503013611,-2.5766699314000001]
["LWK","Lerwick / Tingwall Airport","GB",60.192199707,-1.2436100244999999]
["WRY","Westray Airport","GB",59.350299835199998,-2.9500000477000001]
["CSA","Colonsay Airstrip","GB",56.0574989319,-6.2430601120000002]
["HAW","Haverfordwest Airport","GB",51.833099365199999,-4.9611101151000003]
["CWL","Cardiff International Airport","GB",51.396701812700002,-3.3433299065000002]
["SWS","Swansea Airport","GB",51.605300903299998,-4.0678300857999998]
["BRS","Bristol International Airport","GB",51.382701873800002,-2.7190899849000001]
["LPL","Liverpool John Lennon Airport","GB",53.333599090600003,-2.8497200012000001]
["LTN","London Luton Airport","GB",51.8746986389,-0.36833301190000001]
["LEQ","Land's End Airport","GB",50.102798461900001,-5.6705598831000001]
["PLH","Plymouth City Airport","GB",50.422798156699997,-4.1058301926]
["ISC","St. Mary's Airport","GB",49.9132995605,-6.2916698456000004]
["BOH","Bournemouth Airport","GB",50.779998779300001,-1.8424999714000001]
["SOU","Southampton Airport","GB",50.950298309300003,-1.3567999601]
["BBP","Bembridge Airport","GB",50.678100585899998,-1.1094399691000001]
["QLA","Lasham Airport","GB",51.1871986389,-1.0334999561]
["NQY","Newquay Cornwall Airport","GB",50.440601348900003,-4.9954099655000004]
["QUG","Chichester/Goodwood Airport","GB",50.859401702900001,-0.75916701559999999]
["ACI","Alderney Airport","GG",49.7061004639,-2.2147200107999998]
["GCI","Guernsey Airport","GG",49.435001373299997,-2.6019699574000001]
["JER","Jersey Airport","JE",49.207901001000003,-2.1955099105999998]
["ESH","Shoreham Airport","GB",50.835601806600003,-0.29722198840000003]
["BQH","London Biggin Hill Airport","GB",51.3307991028,3.2499998799999999E-2]
["LGW","London Gatwick Airport","GB",51.148101806600003,-0.19027799370000001]
["KRH","Redhill Aerodrome","GB",51.213600158699997,-0.13861100379999999]
["LCY","London City Airport","GB",51.505298614499999,5.5277999500000001E-2]
["FAB","Farnborough Airport","GB",51.275798797599997,-0.77633297440000004]
["BBS","Blackbushe Airport","GB",51.323898315400001,-0.84750002619999998]
["LHR","London Heathrow Airport","GB",51.470600128199997,-0.46194100380000003]
["SEN","Southend Airport","GB",51.571399688699998,0.69555598500000004]
["LYX","Lydd Airport","GB",50.9561004639,0.93916702269999996]
["MSE","Kent International Airport","GB",51.342201232900003,1.3461099862999999]
["CAX","Carlisle Airport","GB",54.9375,-2.8091700077000001]
["BLK","Blackpool International Airport","GB",53.771701812700002,-3.0286099911000002]
["HUY","Humberside Airport","GB",53.5744018555,-0.35083299880000002]
["BWF","Barrow Walney Island Airport","GB",54.131198883099998,-3.2636699676999998]
["LBA","Leeds Bradford Airport","GB",53.865898132300003,-1.6605700254]
["WRT","Warton Airport","GB",53.745098114000001,-2.8830599785]
["CEG","Hawarden Airport","GB",53.178100585899998,-2.9777801036999998]
["IOM","Isle of Man Airport","IM",54.083301544199998,-4.6238899231000001]
["NCL","Newcastle Airport","GB",55.037498474099998,-1.6916699409]
["MME","Durham Tees Valley Airport","GB",54.509201049799998,-1.4294099808]
["EMA","East Midlands Airport","GB",52.8311004639,-1.3280600308999999]
["HLY","Anglesey Airport","GB",53.248100280800003,-4.5353398323]
["KOI","Kirkwall Airport","GB",58.9578018188,-2.9049999714000001]
["LSI","Sumburgh Airport","GB",59.878898620599998,-1.2955600023]
["WIC","Wick Airport","GB",58.458900451700003,-3.0930600166]
["ABZ","Aberdeen Dyce Airport","GB",57.201900482200003,-2.1977798938999999]
["INV","Inverness Airport","GB",57.542499542199998,-4.0475001334999998]
["GLA","Glasgow International Airport","GB",55.871898651099997,-4.4330601692]
["EDI","Edinburgh Airport","GB",55.950000762899997,-3.3724999428000002]
["ILY","Islay Airport","GB",55.681900024400001,-6.2566699981999996]
["PIK","Glasgow Prestwick Airport","GB",55.509399414100002,-4.5866699218999996]
["BEB","Benbecula Airport","GB",57.481098175,-7.3627800940999997]
["SCS","Scatsta Airport","GB",60.432800293,-1.296110034]
["DND","Dundee Airport","GB",56.4524993896,-3.0258300303999999]
["SYY","Stornoway Airport","GB",58.215599060099997,-6.3311100005999998]
["BRR","Barra Airport","GB",57.022800445599998,-7.4430599212999997]
["PSL","Perth/Scone Airport","GB",56.439201355000002,-3.3722200394000001]
["TRE","Tiree Airport","GB",56.499198913599997,-6.8691701889000001]
["UNT","Unst Airport","GB",60.747200012199997,-0.85385000710000003]
["BOL","Ballykelly Airport","GB",55.060298919700003,-7.0202798842999998]
["FSS","RAF Kinloss","GB",57.649398803700002,-3.5606400966999998]
["ADX","RAF Leuchars","GB",56.372898101799997,-2.8684399128]
["LMO","RAF Lossiemouth","GB",57.705200195300002,-3.3391699790999998]
["CBG","Cambridge Airport","GB",52.205001831099999,0.17499999699999999]
["NWI","Norwich International Airport","GB",52.675800323499999,1.2827800512]
["STN","London Stansted Airport","GB",51.884998321499999,0.23499999939999999]
["QFO","Duxford Airport","GB",52.090801239000001,0.13194400070000001]
["HYC","Wycombe Air Park","GB",51.611698150599999,-0.80833297969999995]
["EXT","Exeter International Airport","GB",50.734401702900001,-3.4138898849000001]
["FZO","Bristol Filton Airport","GB",51.519401550300003,-2.5908300877000001]
["OXF","Oxford (Kidlington) Airport","GB",51.836898803700002,-1.3200000525]
["RCS","Rochester Airport","GB",51.351898193399997,0.50333297249999998]
["BEX","RAF Benson","GB",51.616401672400002,-1.0958299637]
["LKZ","RAF Lakenheath","GB",52.409301757800002,0.56099998949999996]
["MHZ","RAF Mildenhall","GB",52.361900329599997,0.48640599849999999]
["QUY","RAF Wyton","GB",52.357200622599997,-0.107832998]
["FFD","RAF Fairford","GB",51.682201385500001,-1.7900300026]
["BZZ","RAF Brize Norton","GB",51.75,-1.5836199522000001]
["ODH","RAF Odiham","GB",51.234100341800001,-0.94282501939999996]
["WXF","Wethersfield Airport","GB",51.971900939900003,0.50944399829999998]
["NHT","RAF Northolt","GB",51.553001403800003,-0.41816699499999999]
["QCY","RAF Coningsby","GB",53.092998504599997,-0.16601400080000001]
["BEQ","RAF Honington","GB",52.342601776099997,0.77293902640000001]
["OKH","RAF Cottesmore","GB",52.7356987,-0.648769021]
["SQZ","RAF Scampton","GB",53.307800293,-0.55083298680000004]
["HRT","RAF Linton-On-Ouse","GB",54.0489006042,-1.2527500390999999]
["WTN","RAF Waddington","GB",53.1661987305,-0.52381098270000004]
["MRH","RAF Marham","GB",52.648399353000002,0.55069202179999999]
["MPN","Mount Pleasant Airport","FK",-51.822799682599999,-58.447200775100001]
["AMS","Amsterdam Airport Schiphol","NL",52.308601379400002,4.7638897896000003]
["MST","Maastricht Aachen Airport","NL",50.911701202400003,5.7701401711000004]
["QAR","Deelen Air Base","NL",52.060600280800003,5.8730602263999998]
["EIN","Eindhoven Airport","NL",51.4500999451,5.3745298386]
["GRQ","Eelde Airport","NL",53.119701385500001,6.5794401168999999]
["GLZ","Gilze Rijen Air Base","NL",51.567401885999999,4.9318299294000001]
["DHR","De Kooy Airport","NL",52.923400878899997,4.7806200981]
["LEY","Lelystad Airport","NL",52.460300445599998,5.5272197722999996]
["LWR","Leeuwarden Air Base","NL",53.228599548299997,5.7605600357000002]
["RTM","Rotterdam Airport","NL",51.956901550300003,4.4372200965999999]
["ENS","Twenthe Airport","NL",52.270000457800002,6.8741698265000002]
["UDE","Volkel Air Base","NL",51.656398773200003,5.7086100577999996]
["WOE","Woensdrecht Air Base","NL",51.4491004944,4.3420300483999998]
["BYT","Bantry Aerodrome","IE",51.668598175,-9.4841699599999991]
["BLY","Belmullet Aerodrome","IE",54.222801208500002,-10.030799865700001]
["NNR","Connemara Regional Airport","IE",53.230300903299998,-9.4677801131999999]
["CLB","Castlebar Airport","IE",53.848400116000001,-9.2803697585999991]
["WEX","Castlebridge Airport","IE",52.3333320618,-6.4666671752999996]
["ORK","Cork Airport","IE",51.841300964399998,-8.4911098480000007]
["GWY","Galway Airport","IE",53.300201416,-8.9415903091000004]
["CFN","Donegal Airport","IE",55.0442008972,-8.3409996033000002]
["DUB","Dublin Airport","IE",53.421298980700001,-6.2700700759999997]
["IOR","Inishmore Aerodrome","IE",53.1067008972,-9.6536102294999999]
["INQ","Inisheer Aerodrome","IE",53.064701080299997,-9.5108995438000008]
["KKY","Kilkenny Airport","IE",52.650798797599997,-7.2961101531999999]
["NOC","Ireland West Knock Airport","IE",53.910301208500002,-8.8184900283999994]
["KIR","Kerry Airport","IE",52.180900573700001,-9.5237798691000002]
["LTR","Letterkenny Airport","IE",54.951301574699997,-7.6728301048000001]
["IIA","Inishmaan Aerodrome","IE",53.092998504599997,-9.5680599212999997]
["SNN","Shannon Airport","IE",52.701999664299997,-8.9248199462999995]
["SXL","Sligo Airport","IE",54.2802009583,-8.5992097854999994]
["WAT","Waterford Airport","IE",52.1871986389,-7.0869598389000004]
["AAR","Aarhus Airport","DK",56.299999237100003,10.6190004349]
["BLL","Billund Airport","DK",55.740299224899999,9.1517801285000004]
["CPH","Copenhagen Kastrup Airport","DK",55.617900848399998,12.6560001373]
["EBJ","Esbjerg Airport","DK",55.525901794399999,8.5534000396999996]
["KRP","Karup Airport","DK",56.2975006104,9.1246299743999995]
["BYR","Laeso Airport","DK",57.277198791499998,11.0001001358]
["MRW","Lolland Falster Maribo Airport","DK",54.699298858600002,11.440099716200001]
["ODE","Odense Airport","DK",55.476699829099999,10.3309001923]
["RKE","Copenhagen Roskilde Airport","DK",55.585601806600003,12.131400108299999]
["RNN","Bornholm Airport","DK",55.063301086400003,14.7595996857]
["SGD","Sonderborg Airport","DK",54.964401245099999,9.7917299271000005]
["CNL","Sindal Airport","DK",57.503501892099997,10.2293996811]
["SKS","Vojens Skrydstrup Airport","DK",55.225601196299998,9.2639303207000001]
["SQW","Skive Airport","DK",56.550201416,9.1729803084999997]
["TED","Thisted Airport","DK",57.068801879900001,8.7052202224999995]
["FAE","Vagar Airport","FO",62.063598632800002,-7.2772197722999996]
["STA","Stauning Airport","DK",55.990100860600002,8.3539104462000005]
["AAL","Aalborg Airport","DK",57.092758913799997,9.8492431641000007]
["LUX","Luxembourg-Findel International Airport","LU",49.626598358199999,6.2115201950000003]
["AES","Alesund Airport","NO",62.5625,6.1196999549999997]
["ANX","Andoya Airport","NO",69.292503356899999,16.144199371300001]
["ALF","Alta Airport","NO",69.976097106899999,23.371700286900001]
["FDE","Bringeland Airport","NO",61.391101837199997,5.7569398879999998]
["BNN","Bronnoysund Airport","NO",65.461097717300007,12.217499733]
["BOO","Bodo Airport","NO",67.269203185999999,14.3653001785]
["BGO","Bergen Airport Flesland","NO",60.293399810799997,5.2181401252999997]
["BJF","Batsfjord Airport","NO",70.600502014200003,29.691400527999999]
["BVG","Berlevag Airport","NO",70.871398925799994,29.034200668299999]
["KRS","Kristiansand Airport","NO",58.204200744600001,8.0853700637999992]
["DLD","Geilo Airport Dagali","NO",60.417301178000002,8.5183496474999991]
["BDU","Bardufoss Airport","NO",69.055801391599999,18.5403995514]
["EVE","Harstad/Narvik Airport Evenes","NO",68.491302490199999,16.678100585900001]
["VDB","Leirin Airport","NO",61.015598297099999,9.2880601882999994]
["FRO","Floro Airport","NO",61.583599090600003,5.0247201920000002]
["OSL","Oslo Gardermoen Airport","NO",60.193901062000002,11.100399971]
["HMR","Stafsberg Airport","NO",60.818099975599999,11.067999839800001]
["HAU","Haugesund Airport","NO",59.345298767099997,5.2083601952]
["HFT","Hammerfest Airport","NO",70.679702758800005,23.668600082400001]
["HAA","Hasvik Airport","NO",70.4867019653,22.139699935900001]
["HVG","Valan Airport","NO",71.009696960400007,25.983600616499999]
["ZXB","Jan Mayen Jan Mayensfield","NO",70.961111111099996,-8.5758333333000003]
["QKX","Kautokeino Air Base","NO",69.040298461899994,23.034000396700002]
["KSU","Kristiansund Airport Kvernberget","NO",63.111801147500003,7.8245201111]
["GLL","Gol Airport","NO",60.791400909399997,9.0505599976000006]
["KKN","Kirkenes Airport Hoybuktmoen","NO",69.725799560499993,29.8913002014]
["FAN","Lista Airport","NO",58.099498748800002,6.6260499953999998]
["LKN","Leknes Airport","NO",68.152496337900004,13.6093997955]
["MEH","Mehamn Airport","NO",71.029701232899995,27.826700210599999]
["MOL","Molde Airport","NO",62.744701385500001,7.2624998093000004]
["MJF","Mosjoen Airport Kjaerstad","NO",65.783996582,13.2149000168]
["LKL","Banak Airport","NO",70.068801879899993,24.973499298099998]
["NVK","Narvik Framnes Airport","NO",68.4368972778,17.386699676500001]
["OSY","Namsos Hoknesora Airport","NO",64.472198486300002,11.578599929799999]
["NTB","Notodden Airport","NO",59.565700530999997,9.2122201920000002]
["OLA","Orland Airport","NO",63.698898315400001,9.6040000915999997]
["HOV","Orsta-Volda Airport Hovden","NO",62.180000305199997,6.0741000175000002]
["MQN","Mo i Rana Airport Rossvoll","NO",66.363899231000005,14.3014001846]
["RVK","Rorvik Airport Ryum","NO",64.838302612299998,11.146100044300001]
["RRS","Roros Airport","NO",62.578399658199999,11.342300415]
["RET","Rost Airport","NO",67.527801513699998,12.1033000946]
["RYG","Moss Airport Rygge","NO",59.378898620599998,10.7855997086]
["SRP","Stord Airport","NO",59.791900634800001,5.3408498764000001]
["LYR","Svalbard Airport Longyear","NO",78.246101379400002,15.4656000137]
["SDN","Sandane Airport Anda","NO",61.830001831099999,6.1058301926]
["SOG","Sogndal Airport","NO",61.156101226799997,7.1377801894999999]
["SVJ","Svolvaer Helle Airport","NO",68.243301391599999,14.669199943500001]
["SKN","Stokmarknes Skagen Airport","NO",68.578826904300001,15.033416748]
["SKE","Skien Airport","NO",59.185001373299997,9.5669403075999995]
["SOJ","Sorkjosen Airport","NO",69.786796569800003,20.959400176999999]
["VAW","Vardo Airport Svartnes","NO",70.355400085400007,31.044900894200001]
["SSJ","Sandnessjoen Airport Stokka","NO",65.956802368200002,12.4688997269]
["TOS","Tromso Airport","NO",69.683296203599994,18.9188995361]
["TRF","Sandefjord Airport Torp","NO",59.186698913599997,10.258600234999999]
["TRD","Trondheim Airport Vaernes","NO",63.4578018188,10.9239997864]
["VDS","Vadso Airport","NO",70.065299987800003,29.844699859599999]
["SVG","Stavanger Airport Sola","NO",58.876701355000002,5.6377801894999999]
["QYY","Bialystok-Krywlany Airport","PL",53.101398467999999,23.170600891100001]
["BXP","Biala Podlaska Airport","PL",52.005798339800002,23.1436004639]
["BZG","Bydgoszcz Ignacy Jan Paderewski Airport","PL",53.096801757800002,17.977699279799999]
["CZW","Czestochowa-Rudniki Airport","PL",50.886133000000001,19.202472]
["GDN","Gdansk Lech Walesa Airport","PL",54.377601623499999,18.466199874899999]
["QLC","Gliwice Glider Airport","PL",50.269401550300003,18.672800064099999]
["KRK","John Paul II International Airport Krakow-Balice Airport","PL",50.077701568599998,19.784799575800001]
["OSZ","Koszalin Zegrze Airport","PL",54.042499542199998,16.2656002045]
["KTW","Katowice International Airport","PL",50.474300384499998,19.079999923700001]
["QEO","Bielsko-Bialo Kaniow Airfield","PL",49.939998626700003,19.021999359100001]
["LUZ","Lublin Airport","PL",51.240278000000004,22.713611]
["LCJ","Lodz Wladyslaw Reymont Airport","PL",51.721900939900003,19.3980998993]
["QLU","Lublin Radwiec Airport","PL",51.221900939900003,22.394699096699998]
["WMI","Warsaw Modlin Airport","PL",52.4510993958,20.6518001556]
["QWS","Nowy Targ Airport","PL",49.462799072300001,20.050300598100002]
["QYD","Oksywie Military Air Base","PL",54.579700469999999,18.517200469999999]
["QPM","Opole-Polska Nowa Wies Airport","PL",50.633300781199999,17.781700134299999]
["POZ","Poznan-Lawica Airport","PL",52.421001434300003,16.826299667400001]
["RDO","Warsaw-Radom Airport","PL",51.389198303199997,21.213300705000002]
["RZE","Rzeszow-Jasionka Airport","PL",50.1100006104,22.0189990997]
["SZZ","Szczecin-Goleniow Solidarnosc Airport","PL",53.584701538099999,14.902199745200001]
["ZWK","Suwalki Airport","PL",54.072799682599999,22.8992004395]
["SZY","Olsztyn-Mazury Airport","PL",53.481943999999999,20.937778000000002]
["WAW","Warsaw Chopin Airport","PL",52.165699005100002,20.9671001434]
["WRO","Copernicus Wroclaw Airport","PL",51.102699279799999,16.885799408]
["IEG","Zielona Gora-Babimost Airport","PL",52.138500213599997,15.798600196800001]
["RNB","Ronneby Airport","SE",56.266700744600001,15.265000343300001]
["XWP","Hassleholm Bokeberg Airport","SE",56.134406991799999,13.875646591200001]
["GOT","Gothenburg-Landvetter Airport","SE",57.662799835199998,12.279800415]
["JKG","Jonkoping Airport","SE",57.757598877,14.0686998367]
["LDK","Lidkoping-Hovby Airport","SE",58.465499877900001,13.174400329599999]
["GSE","Gothenburg City Airport","SE",57.774700164800002,11.8704004288]
["KVB","Skovde Airport","SE",58.456401825,13.972700119000001]
["THN","Trollhattan-Vanersborg Airport","SE",58.318099975599999,12.345000267]
["KSK","Karlskoga Airport","SE",59.345901489299997,14.495900154099999]
["MXX","Mora Airport","SE",60.957901001000003,14.511400222800001]
["NYO","Stockholm Skavsta Airport","SE",58.788600921600001,16.912200927699999]
["SCR","Salen Scandinavian Mountains Airport","SE",61.158999999999999,12.84]
["KID","Kristianstad Airport","SE",55.921699523900003,14.0854997635]
["JLD","Landskrona Airport","SE",55.945999145499997,12.8699998856]
["OSK","Oskarshamn Airport","SE",57.350498199500002,16.4979991913]
["KLR","Kalmar Airport","SE",56.6855010986,16.287599563600001]
["MMX","Malmo Sturup Airport","SE",55.536305364,13.376197814899999]
["HAD","Halmstad Airport","SE",56.691101074199999,12.820199966400001]
["VXO","Vaxjo Kronoberg Airport","SE",56.929100036599998,14.727999687200001]
["EVG","Sveg Airport","SE",62.047798156699997,14.422900199900001]
["GEV","Gallivare Airport","SE",67.132400512700002,20.814599990800001]
["KRF","Kramfors Solleftea Airport","SE",63.048599243200002,17.768899917599999]
["LYC","Lycksele Airport","SE",64.548301696799996,18.716199874899999]
["SDL","Sundsvall-Harnosand Airport","SE",62.528099060099997,17.443899154699999]
["OER","Ornskoldsvik Airport","SE",63.4082984924,18.989999771099999]
["KRN","Kiruna Airport","SE",67.821998596200004,20.336799621600001]
["SFT","Skelleftea Airport","SE",64.624801635699995,21.076900482199999]
["UME","Umea Airport","SE",63.791801452599998,20.282800674400001]
["VHM","Vilhelmina Airport","SE",64.5791015625,16.8335990906]
["AJR","Arvidsjaur Airport","SE",65.590301513699998,19.2819004059]
["SOO","Soderhamn Airport","SE",61.261501312299998,17.0991001129]
["OSD","Ostersund Airport","SE",63.194400787399999,14.500300407399999]
["ORB","Orebro Airport","SE",59.223701477100001,15.0380001068]
["HFS","Hagfors Airport","SE",60.020099639900003,13.5789003372]
["KSD","Karlstad Airport","SE",59.444698333700003,13.337400436399999]
["VST","Stockholm Vasteras Airport","SE",59.589401245099999,16.633600234999999]
["LLA","Lulea Airport","SE",65.543800353999998,22.1219997406]
["ARN","Stockholm-Arlanda Airport","SE",59.651901245099999,17.918600082400001]
["BMA","Stockholm-Bromma Airport","SE",59.354400634800001,17.941699981700001]
["BLE","Borlange Airport","SE",60.422000885000003,15.5151996613]
["HLF","Hultsfred Airport","SE",57.525798797599997,15.823300361599999]
["GVX","Gavle Sandviken Airport","SE",60.593299865699997,16.951400756799998]
["LPI","Linkoping SAAB Airport","SE",58.406200408899998,15.680500030499999]
["NRK","Norrkoping Airport","SE",58.586299896200003,16.250600814799999]
["TYF","Torsby Airport","SE",60.1576004028,12.9912996292]
["EKT","Eskilstuna Airport","SE",59.351100921600001,16.708400726299999]
["VBY","Visby Airport","SE",57.662799835199998,18.346200942999999]
["VVK","Vastervik Airport","SE",57.779998779300001,16.523599624599999]
["AGH","Angelholm-Helsingborg Airport","SE",56.296100616499999,12.847100257899999]
["SQO","Storuman Airport","SE",64.960899353000002,17.696599960299999]
["IDB","Idre Airport","SE",61.869701385500001,12.689399719200001]
["PJA","Pajala Airport","SE",67.245597839400006,23.068899154699999]
["HMV","Hemavan Airport","SE",65.806098938000005,15.0827999115]
["SPM","Spangdahlem Air Base","DE",49.972698211699999,6.6925001143999996]
["RMS","Ramstein Air Base","DE",49.436901092500001,7.6002798079999998]
["ZCD","Bamberg-Breitenau Airport","DE",49.920555114700001,10.914167404200001]
["GHF","Giebelstadt Army Air Field","DE",49.648101806600003,9.9664897919000008]
["ZCN","Celle Airport","DE",52.591201782200002,10.0221004486]
["ZPQ","Rheine Bentlage Airport","DE",52.2911987305,7.3870000839000003]
["FRZ","Fritzlar Airport","DE",51.114600000000003,9.2859999999999996]
["ZNF","Hanau Army Air Field","DE",50.1692008972,8.9615898131999998]
["ILH","Illesheim Air Base","DE",49.473899841300003,10.388099670400001]
["KZG","Kitzingen Army Air Field","DE",49.743099212600001,10.200599670400001]
["NDZ","Nordholz Airport","DE",53.767700195300002,8.6584997176999998]
["GKE","Geilenkirchen Airport","DE",50.960800170900001,6.0424199103999996]
["RLG","Rostock-Laage Airport","DE",53.918201446499999,12.2783002853]
["QOE","Norvenich Airport","DE",50.831199646000002,6.6581702232]
["WBG","Schleswig Airport","DE",54.459300994899998,9.5163297653000001]
["FNB","Neubrandenburg Airport","DE",53.602199554400002,13.3059997559]
["WIE","Wiesbaden Army Airfield","DE",50.049800872799999,8.3254003525000009]
["FEL","Furstenfeldbruck Airport","DE",48.205554962199997,11.2669439316]
["IGS","Ingolstadt Manching Airport","DE",48.715698242199998,11.5340003967]
["GUT","Gutersloh Airport","DE",51.922798156699997,8.3063297271999996]
["DGP","Daugavpils Intrenational Airport","LV",55.944721221899997,26.665000915499999]
["LPX","Liepaja International Airport","LV",56.517501831099999,21.096900939899999]
["RIX","Riga International Airport","LV",56.923599243200002,23.9710998535]
["VNT","Ventspils International Airport","LV",57.357799530000001,21.5442008972]
["KUN","Kaunas International Airport","LT",54.963901519799997,24.084800720200001]
["KLJ","Klaipeda Airport","LT",55.711898803700002,21.242799758899999]
["PLQ","Palanga International Airport","LT",55.973201751700003,21.093900680499999]
["PNV","Panevezys Air Base","LT",55.729400634800001,24.460800170900001]
["SQQ","Siauliai International Airport","LT",55.893901825,23.395000457799998]
["HLJ","Barysiai Airport","LT",56.070598602300002,23.558099746700002]
["VNO","Vilnius International Airport","LT",54.634101867699997,25.285800933800001]
["ALJ","Alexander Bay Airport","ZA",-28.5750007629,16.533300399800002]
["AGZ","Aggeneys Airport","ZA",-29.281799316400001,18.813899993900002]
["ADY","Alldays Airport","ZA",-22.6790008545,29.055500030499999]
["BIY","Bisho Airport","ZA",-32.897098541299997,27.279100418100001]
["BFN","J B M Hertzog International Airport","ZA",-29.092699050899999,26.302400589000001]
["UTE","Bultfontein Airport","ZA",-28.273368999999999,26.135835]
["CDO","Cradock Airport","ZA",-32.156700134300003,25.645599365199999]
["CPT","Cape Town International Airport","ZA",-33.964801788300001,18.601699829099999]
["DUK","Mubatuba Airport","ZA",-28.368400573700001,32.248100280800003]
["PZL","Zulu Inyala Airport","ZA",-27.849399566700001,32.309700012199997]
["ELS","Ben Schoeman Airport","ZA",-33.035598754900001,27.825899124100001]
["EMG","Empangeni Airport","ZA",-28.719999313399999,31.8899993896]
["ELL","Ellisras Matimba Airport","ZA",-23.726699829099999,27.688299179099999]
["FCB","Ficksburg Sentraoes Airport","ZA",-28.8230991364,27.9088993073]
["GCJ","Grand Central Airport","ZA",-25.986299514799999,28.140100479099999]
["GRJ","George Airport","ZA",-34.005599975599999,22.378900527999999]
["GIY","Giyani Airport","ZA",-23.283300399800002,30.649999618500001]
["QRA","Rand Airport","ZA",-26.2425003052,28.151199340800002]
["HLW","Hluhluwe Airport","ZA",-28.016604988699999,32.2751712799]
["HRS","Harrismith Airport","ZA",-28.235099792500002,29.106199264499999]
["HDS","Hoedspruit Air Force Base Airport","ZA",-24.368600845300001,31.048700332599999]
["KXE","P C Pelser Airport","ZA",-26.871099472000001,26.718000411999999]
["KIM","Kimberley Airport","ZA",-28.802799224899999,24.765199661299999]
["MQP","Kruger Mpumalanga International Airport","ZA",-25.383199691800002,31.105600357099998]
["KOF","Komatipoort Airport","ZA",-25.4402999878,31.9300003052]
["KMH","Johan Pienaar Airport","ZA",-27.456699371300001,23.4113998413]
["KLZ","Kleinsee Airport","ZA",-29.688400268599999,17.093999862699999]
["HLA","Lanseria Airport","ZA",-25.9384994507,27.926099777200001]
["LMR","Lime Acres Finsch Mine Airport","ZA",-28.360099792500002,23.439100265499999]
["LDZ","Londolozi Airport","ZA",-24.750200271600001,31.475700378399999]
["DUR","King Shaka International Airport","ZA",-29.6144444444,31.1197222222]
["LUJ","Lusikisiki Airport","ZA",-31.366699218800001,29.5832996368]
["LCD","Louis Trichardt Airport","ZA",-23.061899185200001,29.864700317400001]
["SDB","Langebaanweg Airport","ZA",-32.968898773200003,18.1602993011]
["LAY","Ladysmith Airport","ZA",-28.581699371300001,29.749700546300001]
["AAM","Malamala Airport","ZA",-24.818099975599999,31.544599533100001]
["MGH","Margate Airport","ZA",-30.857400894200001,30.343000411999999]
["MEZ","Morningside Farm Airport","ZA",-25.704500198400002,26.909000396700002]
["MBD","Mmabatho International Airport","ZA",-25.798400878900001,25.548000335699999]
["LLE","Riverside Airport","ZA",-25.4300003052,31.576700210599999]
["MZY","Mossel Bay Airport","ZA",-34.1582984924,22.058599472000001]
["MZQ","Mkuze Airport","ZA",-27.6261005402,32.044300079300001]
["NCS","Newcastle Airport","ZA",-27.770599365199999,29.9769001007]
["NGL","Ngala Airport","ZA",-24.387800216700001,31.325799942]
["NLP","Nelspruit Airport","ZA",-25.5,30.913799285900001]
["OVG","Overberg Airport","ZA",-34.554901123,20.2506999969]
["OUH","Oudtshoorn Airport","ZA",-33.606998443599998,22.188999175999999]
["JNB","O. R. Tambo International Airport","ZA",-26.133333,28.25]
["AFD","Port Alfred Airport","ZA",-33.554199218800001,26.877700805700002]
["PLZ","Port Elizabeth Airport","ZA",-33.984901428199997,25.617300033599999]
["PBZ","Plettenberg Bay Airport","ZA",-34.090301513699998,23.3278007507]
["PHW","Hendrik Van Eck Airport","ZA",-23.937200546300001,31.155399322499999]
["JOH","Port St Johns Airport","ZA",-31.6058998108,29.519800186200001]
["PRK","Prieska Airport","ZA",-29.683599472000001,22.770599365199999]
["PZB","Pietermaritzburg Airport","ZA",-29.649000167800001,30.398700714099999]
["NTY","Pilanesberg International Airport","ZA",-25.333799362200001,27.173400878900001]
["PTG","Polokwane International Airport","ZA",-23.845300674400001,29.4585990906]
["PCF","Potchefstroom Airport","ZA",-26.670999526999999,27.081899642900002]
["UTW","Queenstown Airport","ZA",-31.9202003479,26.882200241100001]
["RCB","Richards Bay Airport","ZA",-28.740999221799999,32.0920982361]
["RVO","Reivilo Airport","ZA",-27.5471992493,24.1725006104]
["ROD","Robertson Airport","ZA",-33.8121986389,19.9027996063]
["SBU","Springbok Airport","ZA",-29.689300537099999,17.939599990800001]
["ZEC","Secunda Airport","ZA",-26.52409935,29.170099258400001]
["GSS","Sabi Sabi Airport","ZA",-24.9414997101,31.444599151599999]
["SIS","Sishen Airport","ZA",-27.648599624599999,22.9993000031]
["SZK","Skukuza Airport","ZA",-24.960899352999999,31.588699340800002]
["TDT","Tanda Tula Airport","ZA",-24.5335998535,31.2999992371]
["THY","Thohoyandou Airport","ZA",-23.076900482199999,30.383600234999999]
["TCU","Thaba Nchu Tar Airport","ZA",-29.317800521900001,26.822799682599999]
["LTA","Tzaneen Airport","ZA",-23.824399948100002,30.329299926800001]
["ULD","Prince Mangosuthu Buthelezi Airport","ZA",-28.320600509599998,31.4165000916]
["UTN","Pierre Van Ryneveld Airport","ZA",-28.39909935,21.260200500500002]
["ULX","Ulusaba Airport","ZA",-24.7854003906,31.3549003601]
["UTT","K. D. Matanzima Airport","ZA",-31.5478992462,28.674299240100002]
["VRU","Vryburg Airport","ZA",-26.982400894200001,24.728799819900001]
["VIR","Virginia Airport","ZA",-29.770599365199999,31.0583992004]
["VRE","Vredendal Airport","ZA",-31.641000747700001,18.544799804699998]
["VYD","Vryheid Airport","ZA",-27.786899566700001,30.796400070200001]
["PRY","Wonderboom Airport","ZA",-25.6539001465,28.224199294999998]
["WKF","Waterkloof Air Force Base","ZA",-25.829999923700001,28.222499847400002]
["WEL","Welkom Airport","ZA",-27.9979991913,26.669599533100001]
["FRW","Francistown Airport","BW",-21.1595993042,27.474500656099998]
["GNZ","Ghanzi Airport","BW",-21.692499160800001,21.658100128200001]
["JWA","Jwaneng Airport","BW",-24.602300643900001,24.690999984699999]
["BBK","Kasane Airport","BW",-17.832899093599998,25.162399292]
["KHW","Khwai River Lodge Airport","BW",-19.149999618500001,23.783000946000001]
["MUB","Maun Airport","BW",-19.972600936900001,23.431100845300001]
["ORP","Orapa Airport","BW",-21.266700744600001,25.316699981700001]
["QPH","Palapye Airport","BW",-22.5669994354,27.149999618500001]
["GBE","Sir Seretse Khama International Airport","BW",-24.555200576800001,25.9181995392]
["SXN","Sua Pan Airport","BW",-20.553400039700001,26.115800857499998]
["PKW","Selebi Phikwe Airport","BW",-22.058300018299999,27.8288002014]
["SVT","Savuti Airport","BW",-18.520599365199999,24.076700210599999]
["SWX","Shakawe Airport","BW",-18.3738994598,21.8325996399]
["TLD","Limpopo Valley Airport","BW",-22.1891994476,29.126899719200001]
["TBY","Tshabong Airport","BW",-26.033300399800002,22.399999618500001]
["BZV","Maya-Maya Airport","CG",-4.2516999244999996,15.2530002594]
["DJM","Djambala Airport","CG",-2.5329999924000002,14.75]
["KNJ","Kindamba Airport","CG",-3.9500000477000001,14.5170001984]
["LCO","Lague Airport","CG",-2.4500000477000001,14.532999992400001]
["MUY","Mouyondzi Airport","CG",-4.0148739815000001,13.9661121368]
["SIB","Sibiti Airport","CG",-3.6830000877,13.350000381499999]
["NKY","Yokangassi Airport","CG",-4.2170000076000003,13.282999992400001]
["ANJ","Zanaga Airport","CG",-2.8499999046000002,13.8170003891]
["MSX","Mossendjo Airport","CG",-2.9500000477000001,12.699999809299999]
["BOE","Boundji Airport","CG",-1.0329999924,15.3830003738]
["EWO","Ewo Airport","CG",-0.88300001620000002,14.800000190700001]
["GMM","Gamboma Airport","CG",-1.8294029999999999,15.885237]
["ION","Impfondo Airport","CG",1.6169999838,18.0669994354]
["KEE","Kelle Airport","CG",-8.2999996800000003E-2,14.532999992400001]
["MKJ","Makoua Airport","CG",-1.7000000899999999E-2,15.583000183099999]
["FTX","Owando Airport","CG",-0.53135001660000003,15.9500999451]
["SOE","Souanke Airport","CG",2.0669999123,14.1330003738]
["BTB","Betou Airport","CG",3.0499999522999999,18.5]
["OUE","Ouesso Airport","CG",1.6159900427,16.037900924700001]
["KMK","Makabana Airport","CG",-3.4830000400999999,12.6169996262]
["DIS","Ngot Nzoungou Airport","CG",-4.2063499999999996,12.6599]
["PNR","Pointe Noire Airport","CG",-4.8160300254999999,11.886599540700001]
["MTS","Matsapha Airport","SZ",-26.528999328600001,31.307500839199999]
["CRF","Carnot Airport","CF",4.9369997978000004,15.894000053399999]
["BGF","Bangui M'Poko International Airport","CF",4.3984799385000004,18.518800735500001]
["BGU","Bangassou Airport","CF",4.7849998474,22.781000137300001]
["IRO","Birao Airport","CF",10.236399650599999,22.716899871799999]
["BEM","Beni Mellal Airport","MA",32.400001525900002,-6.3333301543999996]
["BBY","Bambari Airport","CF",5.8469400405999998,20.647499084500001]
["NDL","N'Dele Airport","CF",8.4272060393999997,20.635156631499999]
["BOP","Bouar Airport","CF",5.9580001831000002,15.6370000839]
["BIV","Bria Airport","CF",6.5277800560000001,21.9894008636]
["BSN","Bossangoa Airport","CF",6.4920001029999996,17.4290008545]
["BBT","Berberati Airport","CF",4.2215800285,15.7863998413]
["ODA","Ouadda Airport","CF",8.0105600356999993,22.398599624599999]
["AIG","Yalinga Airport","CF",6.5199999808999998,23.260000228900001]
["IMO","Zemio Airport","CF",5.0500001906999996,25.149999618500001]
["MKI","M'Boki Airport","CF",5.3330101967000001,25.931900024400001]
["BTG","Batangafo Airport","CF",7.3141098022,18.3087997437]
["GDI","Gordil Airport","CF",9.5830001830999993,21.732999801599998]
["BMF","Bakouma Airport","CF",5.6939997673000002,22.8010005951]
["ODJ","Ouanda Djalle Airport","CF",8.8999996185000008,22.783000946000001]
["RFA","Rafai Airport","CF",4.9886097908,23.927799224899999]
["BCF","Bouca Airport","CF",6.5170001983999999,18.267000198400002]
["BOZ","Bozoum Airport","CF",6.3441700934999998,16.321899414099999]
["BSG","Bata Airport","GQ",1.9054700136,9.8056802750000003]
["SSG","Malabo Airport","GQ",3.7552700042999998,8.7087202072000007]
["ASI","RAF Ascension Island","SH",-7.9696002007000004,-14.393699646]
["MRU","Sir Seewoosagur Ramgoolam International Airport","MU",-20.430200576800001,57.683601379400002]
["RRG","Sir Charles Gaetan Duval Airport","MU",-19.757699966400001,63.361000060999999]
["NKW","Diego Garcia Naval Support Facility","IO",-7.3132700919999998,72.411102294900004]
["NKS","Nkongsamba Airport","CM",4.9499998093000004,9.9329996108999996]
["KBI","Kribi Airport","CM",2.8738899231000001,9.9777803421000009]
["TKC","Tiko Airport","CM",4.0891900063,9.3605298995999995]
["DLA","Douala International Airport","CM",4.0060801505999999,9.7194795609]
["MMF","Mamfe Airport","CM",5.7041702270999997,9.3063898087000005]
["BLC","Bali Airport","CM",5.8952777777999996,10.0338888889]
["KLE","Kaele Airport","CM",10.092499733,14.445599555999999]
["OUR","Batouri Airport","CM",4.4749999045999997,14.362500190700001]
["GXX","Yagoua Airport","CM",10.356100082399999,15.237199783299999]
["MVR","Salak Airport","CM",10.451399803199999,14.257399559]
["FOM","Foumban Nkounja Airport","CM",5.6369199752999997,10.7508001328]
["NGE","N'Gaoundere Airport","CM",7.3570098877000003,13.559200286899999]
["BTA","Bertoua Airport","CM",4.5486102103999997,13.726099968]
["GOU","Garoua International Airport","CM",9.3358898162999999,13.370100021400001]
["DSC","Dschang Airport","CM",5.4499998093000004,10.0670003891]
["BFX","Bafoussam Airport","CM",5.5369200706999999,10.354599952699999]
["BPC","Bamenda Airport","CM",6.0392398833999996,10.122599601699999]
["EBW","Ebolowa Airport","CM",2.8759999275000001,11.1850004196]
["YAO","Yaounde Airport","CM",3.83604002,11.5235004425]
["NSI","Yaounde Nsimalen International Airport","CM",3.7225599289,11.553299903899999]
["MMQ","Mbala Airport","ZM",-8.8591699599999991,31.336399078399999]
["CIP","Chipata Airport","ZM",-13.558300018300001,32.587200164800002]
["JEK","Jeki Airstrip","ZM",-15.633331999999999,29.603332999999999]
["ZKP","Zyryanka Airport","RU",65.7367019653,150.705001831]
["LUN","Lusaka International Airport","ZM",-15.330800056499999,28.452600479099999]
["KLB","Kalabo Airport","ZM",-14.998299598699999,22.645399093599998]
["KMZ","Kaoma Airport","ZM",-14.800000190700001,24.783000946000001]
["KAA","Kasama Airport","ZM",-10.2166996002,31.133300781300001]
["ZKB","Kasaba Bay Airport","ZM",-8.5249996185000008,30.663000106799998]
["LVI","Livingstone Airport","ZM",-17.821800231899999,25.822700500500002]
["LXU","Lukulu Airport","ZM",-14.374799728399999,23.249500274700001]
["MNS","Mansa Airport","ZM",-11.1370000839,28.872600555399998]
["MFU","Mfuwe Airport","ZM",-13.2588996887,31.936599731400001]
["MNR","Mongu Airport","ZM",-15.2545003891,23.162300109899999]
["ZGM","Ngoma Airport","ZM",-15.9658002853,25.933300018299999]
["NLA","Simon Mwansa Kapwepwe International Airport","ZM",-12.961667,28.516667000000002]
["SXG","Senanga Airport","ZM",-16.100000381499999,23.267000198400002]
["KIW","Southdowns Airport","ZM",-12.900500297500001,28.149900436399999]
["SJQ","Sesheke Airport","ZM",-17.476299285900001,24.3047008514]
["SLI","Solwesi Airport","ZM",-12.173700332599999,26.365100860599998]
["BBZ","Zambezi Airport","ZM",-13.536100387599999,23.108499526999999]
["HAH","Prince Said Ibrahim International Airport","KM",-11.533699989300001,43.271900176999999]
["NWA","Moheli Bandar Es Eslam Airport","KM",-12.2981004715,43.766399383500001]
["YVA","Iconi Airport","KM",-11.710800170900001,43.243900299099998]
["AJN","Ouani Airport","KM",-12.1316995621,44.430301666299997]
["DZA","Dzaoudzi Pamandzi International Airport","YT",-12.804699897800001,45.281101226799997]
["RUN","Roland Garros Airport","RE",-20.887100219699999,55.510299682599999]
["ZSE","Pierrefonds Airport","RE",-21.320899963399999,55.424999237100003]
["OHB","Moramanga Aerodrome","MG",-18.9175,48.218194444399998]
["WML","Malaimbandy Airport","MG",-20.355390292100001,45.543372631099999]
["ATJ","Antsirabe Airport","MG",-19.839221482399999,47.063713073700001]
["WAQ","Antsalova Airport","MG",-18.701273242399999,44.614920616100001]
["VVB","Mahanoro Airport","MG",-19.833000183100001,48.799999237100003]
["TNR","Ivato Airport","MG",-18.7968997955,47.478801727300002]
["JVA","Ankavandra Airport","MG",-18.805009520900001,45.273467302299998]
["BMD","Belo sur Tsiribihina Airport","MG",-19.686700820900001,44.541900634800001]
["ZVA","Miandrivazo Airport","MG",-19.562799453699999,45.450801849400001]
["MXT","Maintirano Airport","MG",-18.0499992371,44.033000946000001]
["ILK","Atsinanana Airport","MG",-19.583000183100001,48.803001403800003]
["TVA","Morafenobe Airport","MG",-17.850083459,44.920467138299998]
["SMS","Sainte Marie Airport","MG",-17.093900680499999,49.815799713099999]
["TMM","Toamasina Airport","MG",-18.109500884999999,49.392501831099999]
["WTA","Tambohorano Airport","MG",-17.476100921600001,43.972801208500002]
["MOQ","Morondava Airport","MG",-20.2847003937,44.317600250200002]
["WTS","Tsiroanomandidy Airport","MG",-18.759676556399999,46.054065227499997]
["VAT","Vatomandry Airport","MG",-19.383333,48.95]
["WAM","Ambatondrazaka Airport","MG",-17.795377608500001,48.442583084100001]
["DIE","Arrachart Airport","MG",-12.349399566700001,49.291698455800002]
["WMR","Mananara Nord Airport","MG",-16.163900375400001,49.773799896200003]
["ZWA","Andapa Airport","MG",-14.6517000198,49.6206016541]
["AMB","Ambilobe Airport","MG",-13.188400268600001,48.987998962399999]
["WBD","Avaratra Airport","MG",-15.199999809299999,48.483001709]
["WPB","Port Berge Airport","MG",-15.584286474100001,47.623586654699999]
["ANM","Antsirabato Airport","MG",-14.9994001389,50.320201873800002]
["IVA","Ambanja Airport","MG",-13.645705313200001,48.459427356699997]
["HVA","Analalava Airport","MG",-14.629699707,47.763801574699997]
["MJN","Amborovy Airport","MG",-15.666841742100001,46.351232528700002]
["NOS","Fascene Airport","MG",-13.312100410499999,48.3148002625]
["DWB","Soalala Airport","MG",-16.101690420699999,45.358836650800001]
["WMP","Mampikony Airport","MG",-16.072269340199998,47.644164562199997]
["BPY","Besalampy Airport","MG",-16.744530296499999,44.482483863799999]
["WMN","Maroantsetra Airport","MG",-15.4366998672,49.688301086400003]
["SVB","Sambava Airport","MG",-14.278599739100001,50.174701690699997]
["TTS","Tsaratanana Airport","MG",-16.751064398299999,47.619016170499997]
["VOH","Vohimarina Airport","MG",-13.3758001328,50.002799987800003]
["WAI","Ambalabe Airport","MG",-14.8987998962,47.993900299099998]
["WMA","Mandritsara Airport","MG",-15.833049408600001,48.833284378099997]
["WBO","Antsoa Airport","MG",-21.606983764700001,45.136020183600003]
["WMD","Mandabe Airport","MG",-21.0463049303,44.9404120445]
["FTU","Tolanaro Airport","MG",-25.0380992889,46.9561004639]
["WFI","Fianarantsoa Airport","MG",-21.4416007996,47.111698150599999]
["RVA","Farafangana Airport","MG",-22.805299758899999,47.820598602300002]
["IHO","Ihosy Airport","MG",-22.4047202024,46.164937019299998]
["MJA","Manja Airport","MG",-21.426105250599999,44.316508769999999]
["WVK","Manakara Airport","MG",-22.119699478099999,48.021701812700002]
["OVA","Bekily Airport","MG",-24.235694754699999,45.304527282700001]
["MNJ","Mananjary Airport","MG",-21.2017993927,48.358299255399999]
["TDV","Samangoky Airport","MG",-21.7000007629,43.733001709]
["MXM","Morombe Airport","MG",-21.753900527999999,43.375499725300003]
["TLE","Toliara Airport","MG",-23.383399963399999,43.728500366200002]
["VND","Vangaindrano Airport","MG",-23.350766591500001,47.581701278700002]
["BKU","Betioky Airport","MG",-23.732999801599998,44.388999939000001]
["AMP","Ampanihy Airport","MG",-24.699699401899998,44.734199523900003]
["WAK","Ankazoabo Airport","MG",-22.2964423522,44.531536102300002]
["AZZ","Ambriz Airport","AO",-7.8622198105000001,13.1161003113]
["SSY","Mbanza Congo Airport","AO",-6.2698998451000003,14.2469997406]
["BUG","Benguela Airport","AO",-12.609000205999999,13.403699874899999]
["NBJ","Dr. Antonio Agostinho Neto International Airport","AO",-9.0467779999999998,13.507194]
["CAB","Cabinda Airport","AO",-5.5969901085,12.188400268600001]
["CFF","Cafunfo Airport","AO",-8.7836103438999995,17.989700317400001]
["PGI","Chitato Airport","AO",-7.3588900566,20.8047008514]
["CBT","Catumbela Airport","AO",-12.4792003632,13.486900329599999]
["CTI","Cuito Cuanavale Airport","AO",-15.160300254799999,19.156099319500001]
["CXM","Camaxilo Airport","AO",-8.3736095428000006,18.923599243200002]
["CAV","Cazombo Airport","AO",-11.8930997849,22.9164009094]
["DUE","Dundo Airport","AO",-7.4008898734999997,20.818500518800001]
["VPE","Ngjiva Pereira Airport","AO",-17.0435009003,15.6837997437]
["NOV","Nova Lisboa Airport","AO",-12.8088998795,15.7604999542]
["SVP","Kuito Airport","AO",-12.4046001434,16.947399139400002]
["LLT","Lobito Airport","AO",-12.371199607799999,13.5366001129]
["LBZ","Lucapa Airport","AO",-8.4457273483000002,20.7320861816]
["LAD","Quatro De Fevereiro Airport","AO",-8.8583698273000007,13.2312002182]
["LZM","Luzamba Airport","AO",-9.1159601212000005,18.049299240100002]
["MEG","Malanje Airport","AO",-9.5250902176000007,16.312400817899999]
["SPP","Menongue Airport","AO",-14.6576004028,17.719800949100001]
["MSZ","Namibe Airport","AO",-15.2611999512,12.146800041200001]
["GXG","Negage Airport","AO",-7.7545099257999999,15.287699699399999]
["PBN","Porto Amboim Airport","AO",-10.722000122100001,13.7655000687]
["VHC","Saurimo Airport","AO",-9.6890697478999996,20.431900024400001]
["SZA","Soyo Airport","AO",-6.1410899162000003,12.3718004227]
["NDD","Sumbe Airport","AO",-11.167900085399999,13.8474998474]
["UAL","Luau Airport","AO",-10.7158002853,22.231100082400001]
["SDD","Lubango Airport","AO",-14.924699783299999,13.574999809299999]
["LUO","Luena Airport","AO",-11.7680997849,19.897699356099999]
["UGO","Uige Airport","AO",-7.6030697823000004,15.0277996063]
["CEO","Waco Kungo Airport","AO",-11.4264001846,15.101400375400001]
["XGN","Xangongo Airport","AO",-16.755399703999998,14.9652996063]
["ARZ","N'zeto Airport","AO",-7.2594399451999996,12.8631000519]
["NZA","Maria Reiche Neuman Airport","PE",-14.8540000916,-74.961502075200002]
["BGB","Booue Airport","GA",-0.1000000015,11.949999809299999]
["KDN","Ndende Airport","GA",-2.4000000953999998,11.3669996262]
["FOU","Fougamou Airport","GA",-1.2829999924,10.6169996262]
["MBC","M'Bigou Airport","GA",-1.8830000162,11.9329996109]
["MGX","Moabi Airport","GA",-2.4330000877,11]
["KDJ","Ville Airport","GA",-0.18299999829999999,10.75]
["KOU","Koulamoutou Airport","GA",-1.1846100092,12.441300392200001]
["MJL","Mouilla Ville Airport","GA",-1.8451399802999999,11.0566997528]
["OYE","Oyem Airport","GA",1.5431100129999999,11.581399917600001]
["OKN","Okondja Airport","GA",-0.66521400210000003,13.6731004715]
["LBQ","Lambarene Airport","GA",-0.70438897609999995,10.2456998825]
["MVX","Minvoul Airport","GA",2.1500000953999998,12.1330003738]
["BMM","Bitam Airport","GA",2.0756399632,11.4932003021]
["MFF","Moanda Airport","GA",-1.5329999924,13.2670001984]
["MKB","Mekambo Airport","GA",1.0169999598999999,13.9329996109]
["POG","Port Gentil Airport","GA",-0.71173900369999998,8.7543802261000003]
["OMB","Omboue Hopital Airport","GA",-1.5747300386,9.2626895905000008]
["MKU","Makokou Airport","GA",0.57921099659999997,12.8908996582]
["LBV","Leon M Ba Airport","GA",0.45860001439999998,9.4122800827000006]
["MZC","Mitzic Airport","GA",0.78299999239999996,11.550000190700001]
["MVB","M'Vengue El Hadj Omar Bongo Ondimba International Airport","GA",-1.6561599970000001,13.437999725299999]
["LTL","Lastourville Airport","GA",-0.82666701080000005,12.7486000061]
["ZKM","Sette Cama Airport","GA",-2.5329999924000002,9.7670001983999999]
["TCH","Tchibanga Airport","GA",-2.8499999046000002,11.0170001984]
["MYB","Mayumba Airport","GA",-3.4584197998000001,10.674076080300001]
["PCP","Principe Airport","ST",1.6629400253,7.4117398261999998]
["TMS","Sao Tome International Airport","ST",0.37817499040000002,6.7121500969000003]
["ANO","Angoche Airport","MZ",-16.181869506799998,39.9452171326]
["BEW","Beira Airport","MZ",-19.796400070200001,34.9076004028]
["FXO","Cuamba Airport","MZ",-14.8149995804,36.529998779300001]
["VPY","Chimoio Airport","MZ",-19.151300430300001,33.429000854500003]
["IHC","Inhaca Airport","MZ",-25.997144699100001,32.929351806600003]
["INH","Inhambane Airport","MZ",-23.876399993900002,35.408500671399999]
["VXC","Lichinga Airport","MZ",-13.274000167800001,35.2663002014]
["LFB","Lumbo Airport","MZ",-15.033100128199999,40.671699523900003]
["MPM","Maputo Airport","MZ",-25.920799255399999,32.572601318399997]
["MUD","Mueda Airport","MZ",-11.672900199900001,39.563098907499999]
["MZB","Mocimboa da Praia Airport","MZ",-11.361800193800001,40.354900360099997]
["MNC","Nacala Airport","MZ",-14.4882001877,40.712200164800002]
["APL","Nampula Airport","MZ",-15.1056003571,39.281799316399997]
["POL","Pemba Airport","MZ",-12.9917621613,40.524013519299999]
["PDD","Ponta do Ouro Airport","MZ",-26.828552246099999,32.8377075195]
["UEL","Quelimane Airport","MZ",-17.855499267599999,36.869098663300001]
["TET","Chingozi Airport","MZ",-16.104799270600001,33.640201568599998]
["VNX","Vilankulo Airport","MZ",-22.0184001923,35.313301086400003]
["VJB","Xai-Xai Airport","MZ",-25.037799835200001,33.627399444600002]
["DES","Desroches Airport","SC",-5.6966999999999999,53.655799999999999]
["SEZ","Seychelles International Airport","SC",-4.6743397712999997,55.521800994899998]
["PRI","Praslin Airport","SC",-4.3192901610999996,55.691398620599998]
["BDI","Bird Island Airport","SC",-3.72472,55.205298999999997]
["DEI","Denis Island Airport","SC",-3.8022200000000002,55.666901000000003]
["FRK","Fregate Island Airport","SC",-4.5830000000000002,55.950001]
["SRH","Sarh Airport","TD",9.1444396972999993,18.374399185200001]
["OGR","Bongor Airport","TD",10.288100242600001,15.3810997009]
["AEH","Abeche Airport","TD",13.847000122100001,20.844299316400001]
["MQQ","Moundou Airport","TD",8.6244096756000008,16.071399688700001]
["LTC","Lai Airport","TD",9.3999996185000008,16.2999992371]
["ATV","Ati Airport","TD",13.2389001846,18.313299179099999]
["NDJ","N'Djamena International Airport","TD",12.1337003708,15.0340003967]
["BKR","Bokoro Airport","TD",12.3830003738,17.0669994354]
["OTC","Bol Airport","TD",13.4433002472,14.739399909999999]
["MVO","Mongo Airport","TD",12.166999816900001,18.6749992371]
["AMC","Am Timan Airport","TD",11.0340003967,20.274000167800001]
["PLF","Pala Airport","TD",9.3780603408999994,14.925000190700001]
["OUT","Bousso Airport","TD",10.4829998016,16.716999053999999]
["AMO","Mao Airport","TD",14.1456003189,15.314399719200001]
["FYT","Faya Largeau Airport","TD",17.917100906400002,19.111099243200002]
["BUQ","Joshua Mqabuko Nkomo International Airport","ZW",-20.017400741599999,28.617900848400001]
["CHJ","Chipinge Airport","ZW",-20.206699371300001,32.628299713099999]
["BFO","Buffalo Range Airport","ZW",-21.008100509599998,31.578599929799999]
["VFA","Victoria Falls International Airport","ZW",-18.095899581899999,25.839000701900002]
["HRE","Harare International Airport","ZW",-17.931800842299999,31.092800140400001]
["KAB","Kariba International Airport","ZW",-16.519800186200001,28.885000228900001]
["UTA","Mutare Airport","ZW",-18.997499465899999,32.627201080299997]
["MVZ","Masvingo International Airport","ZW",-20.055299758899999,30.859100341800001]
["GWE","Thornhill Air Base","ZW",-19.4363994598,29.861900329600001]
["HWN","Hwange National Park Airport","ZW",-18.629899978600001,27.0209999084]
["WKI","Hwange Airport","ZW",-18.3624992371,26.516700744600001]
["CEH","Chelinda Malawi Airport","MW",-10.550000190700001,33.799999237100003]
["BLZ","Chileka International Airport","MW",-15.6791000366,34.973999023399998]
["CMK","Club Makokola Airport","MW",-14.306900024400001,35.132499694800003]
["DWA","Dwangwa Airport","MW",-12.518300056499999,34.131900787399999]
["KGJ","Karonga Airport","MW",-9.9535703658999992,33.893001556400002]
["KBQ","Kasungu Airport","MW",-13.014599800099999,33.468601226799997]
["LLW","Lilongwe International Airport","MW",-13.7894001007,33.780998230000002]
["LIX","Likoma Island Airport","MW",-12.083000183099999,34.733001709]
["MAI","Mangochi Airport","MW",-14.4829998016,35.266998291]
["MYZ","Monkey Bay Airport","MW",-14.083600044300001,34.919700622599997]
["LMB","Salima Airport","MW",-13.755892702500001,34.584188461300002]
["ZZU","Mzuzu Airport","MW",-11.4447002411,34.011798858600002]
["LEF","Lebakeng Airport","LS",-29.890800476100001,28.6555995941]
["LRB","Leribe Airport","LS",-28.855600357099998,28.052799224899999]
["LES","Lesobeng Airport","LS",-29.7828998566,28.316699981700001]
["MSG","Matsaile Airport","LS",-29.840599060100001,28.776399612399999]
["MFC","Mafeteng Airport","LS",-29.801099777200001,27.243600845300001]
["MKH","Mokhotlong Airport","LS",-29.281799316400001,29.072799682599999]
["MSU","Moshoeshoe I International Airport","LS",-29.4622993469,27.552499771099999]
["NKU","Nkaus Airport","LS",-30.021699905399998,28.196899414099999]
["PEL","Pelaneng Airport","LS",-29.120599746700002,28.505300521900001]
["UTG","Quthing Airport","LS",-30.407499313399999,27.6933002472]
["UNE","Qacha's Nek Airport","LS",-30.111700058,28.6718997955]
["SHK","Sehonghong Airport","LS",-29.7308998108,28.768899917599999]
["SKQ","Sekakes Airport","LS",-30.038900375400001,28.370300293]
["SOK","Semonkong Airport","LS",-29.8386001587,28.059999465899999]
["SHZ","Seshutes Airport","LS",-29.267599105799999,28.552299499499998]
["THB","Thaba-Tseka Airport","LS",-29.522800445600001,28.615800857499998]
["TKO","Tlokoeng Airport","LS",-29.232999801599998,28.882999420200001]
["ADI","Arandis Airport","NA",-22.462200164799999,14.9799995422]
["GOG","Gobabis Airport","NA",-22.504400253299998,18.9731006622]
["GFY","Grootfontein Airport","NA",-19.602199554399999,18.1226997375]
["MPA","Katima Mulilo Airport","NA",-17.634399414099999,24.176700592]
["KMP","Keetmanshoop Airport","NA",-26.539800643900001,18.1114006042]
["LHU","Lianshulu Airport","NA",-18.116699218800001,23.3932991028]
["LUD","Luderitz Airport","NA",-26.687400817899999,15.242899894700001]
["MJO","Mount Etjo Airport","NA",-21.023300170900001,16.4528007507]
["OKU","Mokuti Lodge Airport","NA",-18.812799453699999,17.059400558499998]
["NNI","Namutoni Airport","NA",-18.806400299100002,16.927200317400001]
["OND","Ondangwa Airport","NA",-17.878200531000001,15.9525995255]
["OMG","Omega Airport","NA",-18.030300140400001,22.189699173000001]
["OMD","Oranjemund Airport","NA",-28.584699630700001,16.446699142500002]
["OKF","Okaukuejo Airport","NA",-19.1492004395,15.911899566700001]
["OTJ","Otjiwarongo Airport","NA",-20.4347000122,16.660800933800001]
["NDU","Rundu Airport","NA",-17.9564990997,19.7194004059]
["RHN","Skorpion Mine Airport","NA",-27.876399993900002,16.647800445600001]
["SWP","Swakopmund Airport","NA",-22.661899566700001,14.568099975599999]
["SZM","Sesriem Airstrip","NA",-24.512800216700001,15.746700286899999]
["TSB","Tsumeb Airport","NA",-19.261899948100002,17.732500076299999]
["WVB","Walvis Bay Airport","NA",-22.9799003601,14.6452999115]
["ERS","Eros Airport","NA",-22.612199783299999,17.080400466899999]
["WDH","Hosea Kutako International Airport","NA",-22.4799003601,17.470899581899999]
["FIH","Ndjili International Airport","CD",-4.3857498168999998,15.444600105299999]
["NLO","Ndolo Airport","CD",-4.3266601563,15.327500343300001]
["MNB","Muanda Airport","CD",-5.9308600426,12.3517999649]
["BOA","Boma Airport","CD",-5.8540000915999997,13.0640001297]
["LZI","Luozi Airport","CD",-4.9499998093000004,14.1330003738]
["MAT","Tshimpi Airport","CD",-5.7996101379000002,13.4404001236]
["NKL","Nkolo Fuma Airport","CD",-5.4499998093000004,14.833000183099999]
["INO","Inongo Airport","CD",-1.9472199678,18.285800933800001]
["NIO","Nioki Airport","CD",-2.7174999714000001,17.6847000122]
["FDU","Bandundu Airport","CD",-3.3113200665,17.3817005157]
["KRZ","Basango Mboliasa Airport","CD",-1.4349999428,19.024000167800001]
["KKW","Kikwit Airport","CD",-5.0357699393999997,18.7856006622]
["IDF","Idiofa Airport","CD",-5,19.600000381499999]
["LUS","Lusanga Airport","CD",-4.8000001906999996,18.716999053999999]
["MSM","Masi Manimba Airport","CD",-4.7829999923999997,17.850000381499999]
["MDK","Mbandaka Airport","CD",2.2600000700000001E-2,18.2887001038]
["BSU","Basankusu Airport","CD",1.2247200011999999,19.788900375400001]
["LIE","Libenge Airport","CD",3.6329998969999999,18.632999420200001]
["BDT","Gbadolite Airport","CD",4.2532100677000004,20.975299835200001]
["GMA","Gemena Airport","CD",3.2353699207000002,19.771299362200001]
["KLI","Kotakoli Airport","CD",4.1576399802999999,21.6508998871]
["BMB","Bumbar Airport","CD",2.1827800274000002,22.4817008972]
["LIQ","Lisala Airport","CD",2.1706600189,21.496900558499998]
["BNB","Boende Airport","CD",-0.21699999270000001,20.850000381499999]
["IKL","Ikela Airport","CD",-1.2000000476999999,23.283000946000001]
["FKI","Bangoka International Airport","CD",0.48163899780000002,25.337999343900002]
["YAN","Yangambi Airport","CD",0.78299999239999996,24.466999053999999]
["IRP","Matari Airport","CD",2.8276100158999999,27.588300705000002]
["BUX","Bunia Airport","CD",1.5657199621,30.220800399800002]
["BZU","Buta Zega Airport","CD",2.8183500766999998,24.793699264499999]
["BKY","Bukavu Kavumu Airport","CD",-2.3089799880999999,28.8087997437]
["RUE","Rughenda Airfield","CD",0.117142,29.312992000000001]
["GOM","Goma International Airport","CD",-1.6708099841999999,29.2385005951]
["BNC","Beni Airport","CD",0.57499998809999997,29.4738998413]
["KND","Kindu Airport","CD",-2.9191799164000001,25.9153995514]
["KLY","Kinkungwa Airport","CD",-2.5780000687000002,26.733999252299999]
["KGN","Kasongo Airport","CD",-4.5329999923999997,26.617000579799999]
["PUN","Punia Airport","CD",-1.3669999838,26.333000183100001]
["FBM","Lubumbashi International Airport","CD",-11.591300010699999,27.5308990479]
["PWO","Pweto Airport","CD",-8.4670000075999994,28.882999420200001]
["KEC","Kasenga Airport","CD",-10.350000381499999,28.632999420200001]
["KWZ","Kolwezi Airport","CD",-10.7658996582,25.505699157700001]
["MNO","Manono Airport","CD",-7.2888898848999997,27.394399642900002]
["BDV","Moba Airport","CD",-7.0669999123,29.783000946000001]
["FMI","Kalemie Airport","CD",-5.8755598068000001,29.25]
["KBO","Kabalo Airport","CD",-6.0830001831000002,26.916999816899999]
["KOO","Kongolo Airport","CD",-5.3944401740999997,26.989999771099999]
["KMN","Ville Airport","CD",-8.7286100387999994,24.991399765000001]
["KAP","Kapanga Airport","CD",-8.3500003814999992,22.583000183100001]
["KNM","Kaniama Airport","CD",-7.5830001831000002,24.149999618500001]
["KGA","Kananga Airport","CD",-5.9000501633000004,22.469200134299999]
["LZA","Luiza Airport","CD",-7.1830000877,22.399999618500001]
["TSH","Tshikapa Airport","CD",-6.4383301734999998,20.794700622600001]
["LJA","Lodja Airport","CD",-3.4170000552999999,23.4500007629]
["LBO","Lusambo Airport","CD",-4.9616699218999996,23.378299713099999]
["MEW","Mweka Airport","CD",-4.8499999045999997,21.5499992371]
["BAN","Basongo Airport","CD",-4.3169999123,20.4330005646]
["PFR","Ilebo Airport","CD",-4.3330001831000002,20.583000183100001]
["MJM","Mbuji Mayi Airport","CD",-6.1212401390000002,23.5690002441]
["GDJ","Gandajika Airport","CD",-6.7329998016000001,23.9500007629]
["KBN","Tunta Airport","CD",-6.1329998970000004,24.482999801599998]
["BKO","Senou Airport","ML",12.5334997177,-7.9499402045999998]
["GUD","Goundam Airport","ML",16.3614006042,-3.5997200012000001]
["GAQ","Gao Airport","ML",16.248399734500001,-5.4560001000000004E-3]
["KNZ","Kenieba Airport","ML",12.833000183099999,-11.25]
["KTX","Koutiala Airport","ML",12.3830003738,-5.4670000076000003]
["KYS","Kayes Dag Dag Airport","ML",14.4812002182,-11.404399871800001]
["MZI","Ambodedjo Airport","ML",14.512800216700001,-4.0795598030000004]
["NRM","Nara Airport","ML",15.217000007599999,-7.2670001983999999]
["NIX","Nioro du Sahel Airport","ML",15.2381000519,-9.5761098861999994]
["KSS","Sikasso Airport","ML",11.333000183099999,-5.6999998093000004]
["TOM","Timbuktu Airport","ML",16.730499267599999,-3.0075800418999998]
["EYL","Yelimane Airport","ML",15.1330003738,-10.5670003891]
["BJL","Banjul International Airport","GM",13.338000297500001,-16.6522006989]
["FUE","Fuerteventura Airport","ES",28.452699661299999,-13.8638000488]
["GMZ","La Gomera Airport","ES",28.0296001434,-17.2145996094]
["VDE","Hierro Airport","ES",27.8148002625,-17.887100219699999]
["SPC","La Palma Airport","ES",28.626499175999999,-17.755599975599999]
["LPA","Gran Canaria Airport","ES",27.931900024400001,-15.386599540700001]
["ACE","Lanzarote Airport","ES",28.945499420200001,-13.605199813800001]
["TFS","Tenerife South Airport","ES",28.044500351,-16.572500228900001]
["TFN","Tenerife Norte Airport","ES",28.4827003479,-16.341499328600001]
["MLN","Melilla Airport","ES",35.279800414999997,-2.9562599659000002]
["BTE","Sherbro International Airport","SL",7.5324201583999999,-12.518899917600001]
["KBS","Bo Airport","SL",7.9443998337000004,-11.760999679599999]
["GBK","Gbangbatok Airport","SL",7.7670001983999999,-12.3830003738]
["HGS","Hastings Airport","SL",8.3971300124999999,-13.129099845900001]
["KBA","Kabala Airport","SL",9.6383229133999997,-11.515560150100001]
["KEN","Kenema Airport","SL",7.8912901878000001,-11.176600456199999]
["FNA","Lungi International Airport","SL",8.6164398193,-13.1955003738]
["WYE","Yengema Airport","SL",8.6104698181000003,-11.0453996658]
["BQE","Bubaque Airport","GW",11.2973556519,-15.838079452500001]
["OXB","Osvaldo Vieira International Airport","GW",11.894800186199999,-15.653699874899999]
["UCN","Buchanan Airport","LR",5.1676502227999999,-9.2834701537999997]
["CPA","Cape Palmas Airport","LR",4.3790202140999996,-7.6969499588000003]
["SNI","Greenville Sinoe Airport","LR",5.0343098639999999,-9.0668001174999997]
["MLW","Spriggs Payne Airport","LR",6.2890601157999999,-10.7587003708]
["NIA","Nimba Airport","LR",7.5,-8.6000003814999992]
["ROB","Roberts International Airport","LR",6.2337899207999996,-10.3622999191]
["SAZ","Sasstown Airport","LR",4.6666669846,-8.4333333969000002]
["THC","Tchien Airport","LR",6.0456504822000001,-8.1387233733999995]
["VOI","Voinjama Airport","LR",8.3999996185000008,-9.7670001983999999]
["AGA","Al Massira Airport","MA",30.3250007629,-9.4130697249999997]
["TTA","Tan Tan Airport","MA",28.448200225800001,-11.161299705499999]
["OZG","Zagora Airport","MA",30.3202991486,-5.8666701317000003]
["UAR","Bouarfa Airport","MA",32.514305555599996,-1.9830555556]
["FEZ","Saiss Airport","MA",33.927299499500002,-4.9779601096999997]
["ERH","Moulay Ali Cherif Airport","MA",31.947500228900001,-4.3983302116000003]
["MEK","Bassatine Airport","MA",33.879100799600003,-5.5151200294000002]
["OUD","Angads Airport","MA",34.787200927699999,-1.9239900111999999]
["SMW","Smara Airport","EH",26.731800079300001,-11.6847000122]
["GMD","Ben Slimane Airport","MA",33.655399322500003,-7.2214498520000001]
["CAS","Anfa Airport","MA",33.553298950200002,-7.6613898276999999]
["RBA","Rabat-Sale Airport","MA",34.051498413099999,-6.7515201568999998]
["SII","Sidi Ifni Xx Airport","MA",29.366699218800001,-10.187800407399999]
["VIL","Dakhla Airport","EH",23.718299865700001,-15.932000160199999]
["ESU","Mogador Airport","MA",31.397499084500001,-9.6816701889000001]
["EUN","Hassan I Airport","EH",27.151699066199999,-13.219200134299999]
["CMN","Mohammed V International Airport","MA",33.367500305199997,-7.5899701117999996]
["SFI","Safi Airport","MA",32.2832984924,-9.2333297728999995]
["NDR","Nador International Airport","MA",34.988800048800002,-3.0282099247000001]
["RAK","Menara Airport","MA",31.606899261500001,-8.0362997054999994]
["NNA","Kenitra Airport","MA",34.2989006042,-6.5958800316000001]
["OZZ","Ouarzazate Airport","MA",30.939100265499999,-6.909430027]
["AHU","Cherif Al Idrissi Airport","MA",35.177101135299999,-3.8395199776000002]
["TTU","Saniat Rmel Airport","MA",35.594299316399997,-5.3200201988]
["TNG","Ibn Batouta Airport","MA",35.726898193399997,-5.9168901443999999]
["DSS","Blaise Diagne International Airport","SN",14.671111,-17.066943999999999]
["KDA","Kolda North Airport","SN",12.8985004425,-14.9680995941]
["ZIG","Ziguinchor Airport","SN",12.5556001663,-16.281799316400001]
["CSK","Cap Skirring Airport","SN",12.410200119000001,-16.746099472000001]
["KLC","Kaolack Airport","SN",14.146900176999999,-16.051300048800002]
["DKR","Leopold Sedar Senghor International Airport","SN",14.739700317400001,-17.4902000427]
["MAX","Ouro Sogui Airport","SN",15.5936002731,-13.322799682599999]
["POD","Podor Airport","SN",16.6830005646,-14.967000007599999]
["RDT","Richard Toll Airport","SN",16.4330005646,-15.649999618500001]
["XLS","Saint Louis Airport","SN",16.050800323499999,-16.463199615499999]
["BXE","Bakel Airport","SN",14.847299575799999,-12.468299865700001]
["KGG","Kedougou Airport","SN",12.5722999573,-12.2202997208]
["SMY","Simenti Airport","SN",13.0467996597,-13.2953996658]
["TUD","Tambacounda Airport","SN",13.736800193800001,-13.6531000137]
["AEO","Aioun el Atrouss Airport","MR",16.7112998962,-9.6378803252999994]
["OTL","Boutilimit Airport","MR",17.533000946000001,-14.6829996109]
["THI","Tichitt Airport","MR",18.4500007629,-9.5170001983999999]
["TIY","Tidjikja Airport","MR",18.570100784299999,-11.423500061]
["BGH","Abbaye Airport","MR",16.633314132700001,-14.2000007629]
["KFA","Kiffa Airport","MR",16.590000152599998,-11.4062004089]
["TMD","Timbedra Airport","MR",16.232999801599998,-8.1669998169000007]
["EMN","Nema Airport","MR",16.6219997406,-7.3165998458999999]
["AJJ","Akjoujt Airport","MR",19.733016967800001,-14.3832492828]
["KED","Kaedi Airport","MR",16.159500122099999,-13.5075998306]
["MOM","Letfotar Airport","MR",17.75,-12.5]
["NKC","Nouakchott International Airport","MR",18.0981998444,-15.948499679599999]
["SEY","Selibaby Airport","MR",15.179699897800001,-12.207300186199999]
["THT","Tamchakett Airport","MR",17.232999801599998,-10.8170003891]
["ATR","Atar International Airport","MR",20.5067996979,-13.0431995392]
["FGD","Fderik Airport","MR",22.666999816899999,-12.7329998016]
["NDB","Nouadhibou International Airport","MR",20.933099746700002,-17.030000686600001]
["OUZ","Tazadit Airport","MR",22.756399154699999,-12.4835996628]
["CKY","Conakry Airport","GN",9.5768900000000006,-13.612]
["FIG","Fria Airport","GN",10.350600242600001,-13.5691995621]
["FAA","Faranah Airport","GN",10.035499572799999,-10.769800186199999]
["KSI","Kissidougou Airport","GN",9.1605596542000001,-10.1244001389]
["LEK","Labe Airport","GN",11.326100349400001,-12.286800384499999]
["MCA","Macenta Airport","GN",8.5329999924000006,-9.4670000075999994]
["NZE","Nzerekore Airport","GN",7.8060193061999996,-8.7017974854000002]
["BKJ","Boke Airport","GN",10.9658002853,-14.2811002731]
["SBI","Sambailo Airport","GN",12.572699546799999,-13.358499526999999]
["GII","Siguiri Airport","GN",11.4329996109,-9.1669998169000007]
["KNN","Kankan Airport","GN",10.394000053399999,-9.3037996292000003]
["SID","Amilcar Cabral International Airport","CV",16.741399765000001,-22.949399948100002]
["NTO","Agostinho Neto Airport","CV",17.2028007507,-25.090599060100001]
["BVC","Rabil Airport","CV",16.1364994049,-22.888900756799998]
["BVR","Esperadinha Airport","CV",14.8643055556,-24.745999999999999]
["MMO","Maio Airport","CV",15.155900001499999,-23.213699340800002]
["MTI","Mosteiros Airport","CV",15.045000076299999,-24.339199066199999]
["RAI","Praia International Airport","CV",14.9245004654,-23.4934997559]
["SFL","Sao Filipe Airport","CV",14.885000228899999,-24.479999542200002]
["SNE","Preguica Airport","CV",16.5883998871,-24.2847003937]
["VXE","Sao Pedro Airport","CV",16.833200454699998,-25.055299758899999]
["ADD","Bole International Airport","ET",8.9778900146999998,38.799301147500003]
["AMH","Arba Minch Airport","ET",6.0393900871000001,37.590499877900001]
["AXU","Axum Airport","ET",14.146800041200001,38.772800445599998]
["BCO","Baco Airport","ET",5.7828698157999998,36.562000274699997]
["BJR","Bahir Dar Airport","ET",11.6080999374,37.321601867699997]
["BEI","Beica Airport","ET",9.3863897323999996,34.521900176999999]
["DSE","Combolcha Airport","ET",11.0825004578,39.711399078399999]
["DEM","Dembidollo Airport","ET",8.5539999007999992,34.858001709]
["DBM","Debra Marcos Airport","ET",10.350000381499999,37.716999053999999]
["DIR","Aba Tenna Dejazmach Yilma International Airport","ET",9.6246995926000007,41.854198455800002]
["DBT","Debre Tabor Airport","ET",11.967000007599999,38]
["FNH","Fincha Airport","ET",9.5830001830999993,37.349998474099998]
["GOB","Robe Airport","ET",7.0170001983999999,40]
["GNN","Ghinnir Airport","ET",7.1500000954000003,40.716999053999999]
["GMB","Gambella Airport","ET",8.1287603377999993,34.563098907499999]
["GDQ","Gonder Airport","ET",12.519900322,37.433998107900003]
["GDE","Gode Airport","ET",5.9351301193000001,43.578601837199997]
["GOR","Gore Airport","ET",8.1614000000000004,35.552900000000001]
["QHR","Harar Meda Airport","ET",8.7163000000000004,39.005899999999997]
["HUE","Humera Airport","ET",14.25,36.583000183099998]
["JIJ","Jijiga Airport","ET",9.3308330000000002,42.911110999999998]
["JIM","Jimma Airport","ET",7.6660900115999997,36.816600799600003]
["ABK","Kabri Dehar Airport","ET",6.7340002060000002,44.252998352100001]
["LFO","Kelafo East Airport","ET",5.6570000648000001,44.349998474099998]
["AWA","Awassa Airport","ET",7.0669999123,38.5]
["LLI","Lalibella Airport","ET",11.975000381499999,38.979999542199998]
["TUJ","Tume Airport","ET",5.8330001831000002,35.533000946000001]
["MQX","Mekele Airport","ET",13.4673995972,39.533500671399999]
["MZX","Masslo Airport","ET",6.4080600738999998,39.723899841300003]
["ETE","Metema Airport","ET",12.9329996109,36.166999816900002]
["NDM","Mendi Airport","ET",9.7670001983999999,35.099998474099998]
["MTF","Mizan Teferi Airport","ET",6.9570999999999996,35.554699999999997]
["NEJ","Nejjo Airport","ET",9.5500001907000005,35.466999053999999]
["NEK","Nekemte Airport","ET",9.0500001907000005,36.599998474099998]
["SHC","Shire Airport","ET",14.079444000000001,38.270833000000003]
["SXU","Soddu Airport","ET",6.8169999123,37.75]
["SZE","Semera Airport","ET",11.7875,40.991667]
["ASO","Asosa Airport","ET",10.0185003281,34.586299896200003]
["TIE","Tippi Airport","ET",7.2023999999999999,35.414999999999999]
["WAC","Waca Airport","ET",7.1669998168999998,37.166999816900002]
["BJM","Bujumbura International Airport","BI",-3.3240199089,29.318500518800001]
["GID","Gitega Airport","BI",-3.4172093868000002,29.911308288600001]
["KRE","Kirundo Airport","BI",-2.544772,30.094574999999999]
["ALU","Alula Airport","SO",11.9582,50.747999999999998]
["BIB","Baidoa Airport","SO",3.1022200583999999,43.628601074199999]
["CXN","Candala Airport","SO",11.5,49.916999816900002]
["BSY","Bardera Airport","SO",2.3361109999999998,42.307777999999999]
["HCM","Eil Airport","SO",7.9169998168999998,49.799999237100003]
["BSA","Bosaso Airport","SO",11.2753000259,49.149398803700002]
["GSR","Gardo Airport","SO",9.5170001983999999,49.083000183099998]
["HGA","Egal International Airport","SO",9.5181703568000007,44.088798522899999]
["BBO","Berbera Airport","SO",10.3892002106,44.941101074199999]
["KMU","Kisimayu Airport","SO",-0.37735301259999998,42.459201812700002]
["MGQ","Aden Adde International Airport","SO",2.0144400597000001,45.304698944099997]
["CMO","Obbia Airport","SO",5.3666667938000003,48.516666412399999]
["GLK","Galcaio Airport","SO",6.7808299065000002,47.454700469999999]
["CMS","Scusciuban Airport","SO",10.300000190700001,50.233001709]
["ERA","Erigavo Airport","SO",10.642050549,47.387981414800002]
["BUO","Burao Airport","SO",9.5274999999999999,45.554900000000004]
["JIB","Djibouti-Ambouli Airport","DJ",11.5473003387,43.159500122099999]
["AII","Ali-Sabieh Airport","DJ",11.1468888889,42.72]
["MHI","Moucha Airport","DJ",11.7166671753,43.200000762899997]
["OBC","Obock Airport","DJ",11.967000007599999,43.266998291]
["TDJ","Tadjoura Airport","DJ",11.782999992400001,42.916999816900002]
["SEW","Siwa Oasis North Airport","EG",29.345500946000001,25.5067005157]
["DBB","El Alamein International Airport","EG",30.924499511699999,28.461399078399999]
["AAC","El Arish International Airport","EG",31.073299408,33.835800170900001]
["ATZ","Assiut International Airport","EG",27.046499252299999,31.0119991302]
["ALY","El Nouzha Airport","EG",31.183900833100001,29.948900222799999]
["HBE","Borg El Arab International Airport","EG",30.917699813799999,29.696399688700001]
["ABS","Abu Simbel Airport","EG",22.3759994507,31.611700058]
["CAI","Cairo International Airport","EG",30.121900558499998,31.4055995941]
["CCE","Cairo Capital International Airport","EG",30.075832999999999,31.833333]
["CWE","Cairo West Airport","EG",30.116399765000001,30.9153995514]
["DAK","Dakhla Airport","EG",25.4116001129,29.003099441500002]
["HRG","Hurghada International Airport","EG",27.178300857499998,33.799400329599997]
["EGH","El Gora Airport","EG",31.0690002441,34.129199981699998]
["UVL","El Kharga Airport","EG",25.473600387600001,30.590700149500002]
["LXR","Luxor International Airport","EG",25.670999526999999,32.706600189200003]
["RMF","Marsa Alam International Airport","EG",25.557100296000002,34.583698272699998]
["HMB","Sohag International Airport","EG",26.342777777799999,31.742777777800001]
["MUH","Mersa Matruh Airport","EG",31.325399398799998,27.221700668299999]
["GSQ","Shark El Oweinat International Airport","EG",22.585699081400001,28.716600418100001]
["PSD","Port Said Airport","EG",31.279399871799999,32.240001678500001]
["SKV","St Catherine International Airport","EG",28.685300826999999,34.0625]
["SSH","Sharm El Sheikh International Airport","EG",27.977300643900001,34.395000457800002]
["ASW","Aswan International Airport","EG",23.9643993378,32.819999694800003]
["SPX","Sphinx International Airport","EG",30.114722199999999,30.893333299999998]
["TCP","Taba International Airport","EG",29.587799072300001,34.778099060099997]
["ELT","El Tor Airport","EG",28.208999633800001,33.645500183099998]
["ASM","Asmara International Airport","ER",15.2918996811,38.910701751700003]
["MSW","Massawa International Airport","ER",15.670000076299999,39.370098114000001]
["ASA","Assab International Airport","ER",13.071800231899999,42.645000457800002]
["TES","Tessenei Airport","ER",15.1169996262,36.682998657200002]
["ASV","Amboseli Airport","KE",-2.6450500487999999,37.253101348900003]
["EDL","Eldoret International Airport","KE",0.40445798640000002,35.238899230999998]
["EYS","Eliye Springs Airport","KE",3.2166700363,35.9667015076]
["KLK","Kalokol Airport","KE",3.4830000400999999,35.833000183099998]
["GAS","Garissa Airport","KE",-0.46350800990000002,39.648300170900001]
["HOA","Hola Airport","KE",-1.5219999552000001,40.0040016174]
["NBO","Jomo Kenyatta International Airport","KE",-1.319239974,36.927799224899999]
["KEU","Keekorok Airport","KE",-1.5829999447000001,35.25]
["GGM","Kakamega Airport","KE",0.27134200930000002,34.787300109900002]
["KIS","Kisumu Airport","KE",-8.6139001000000007E-2,34.728900909399997]
["ILU","Kilaguni Airport","KE",-2.9106099606,38.065200805700002]
["KEY","Kericho Airport","KE",-0.41699999570000001,35.25]
["KTL","Kitale Airport","KE",0.971988976,34.958599090600003]
["LKG","Lokichoggio Airport","KE",4.2041201591000004,34.348201751700003]
["LOK","Lodwar Airport","KE",3.1219699382999999,35.6086997986]
["LAU","Manda Airstrip","KE",-2.2524199486000001,40.913101196299998]
["LOY","Loyengalani Airport","KE",2.75,36.716999053999999]
["NDE","Mandera Airport","KE",3.9330000877,41.849998474099998]
["RBT","Segel Airport","KE",2.3499999046000002,37.983001709]
["JJM","Mulika Lodge Airport","KE",0.165083006,38.195140838599997]
["MYD","Malindi Airport","KE",-3.2293100357000002,40.101699829099999]
["MBA","Mombasa Moi International Airport","KE",-4.0348300934000001,39.594200134300003]
["MRE","Mara Serena Lodge Airstrip","KE",-1.4061110020000001,35.008056640600003]
["OYL","Moyale Airport","KE",3.4697198868000001,39.101398467999999]
["NYE","Nyeri Airport","KE",-0.3644140065,36.978485107399997]
["NUU","Nakuru Airport","KE",-0.29806700349999998,36.159301757800002]
["WIL","Nairobi Wilson Airport","KE",-1.3217200040999999,36.8148002625]
["NYK","Nanyuki Airport","KE",-6.2398899299999998E-2,37.041007995599998]
["UAS","Samburu South Airport","KE",0.53058302400000001,37.534194946299998]
["UKA","Ukunda Airstrip","KE",-4.2933301926,39.571098327599998]
["WJR","Wajir Airport","KE",1.7332400083999999,40.091598510700003]
["SRX","Gardabya Airport","LY",31.0634994507,16.594999313399999]
["TOB","Gamal Abdel Nasser Airport","LY",31.861000060999999,23.906999588000001]
["GHT","Ghat Airport","LY",25.145599365199999,10.142600059499999]
["AKF","Kufra Airport","LY",24.1786994934,23.313999175999999]
["BEN","Benina International Airport","LY",32.096801757800002,20.269500732400001]
["MJI","Mitiga Airport","LY",32.894100189200003,13.2760000229]
["LAQ","La Abraq Airport","LY",32.788700103799997,21.9643001556]
["SEB","Sabha Airport","LY",26.986999511699999,14.4724998474]
["TIP","Tripoli International Airport","LY",32.663501739499999,13.1590003967]
["LMQ","Marsa Brega Airport","LY",30.378099441500002,19.576400756799998]
["NFR","Nafurah 1 Airport","LY",29.213199615499999,21.5923995972]
["HUQ","Hon Airport","LY",29.110099792500002,15.9656000137]
["LTD","Ghadames East Airport","LY",30.151699066199999,9.7153100966999997]
["WAX","Zwara Airport","LY",32.952301025399997,12.0155000687]
["GYI","Gisenyi Airport","RW",-1.6771999598,29.258899688700001]
["BTQ","Butare Airport","RW",-2.5958299637,29.736700058]
["KGL","Kigali International Airport","RW",-1.9686299563,30.139499664300001]
["RHG","Ruhengeri Airport","RW",-1.5,29.632999420200001]
["KME","Kamembe Airport","RW",-2.4622399807000002,28.9078998566]
["ATB","Atbara Airport","SD",17.7103443146,34.057018280000001]
["EDB","El Debba Airport","SD",18.024999618500001,30.9582996368]
["DOG","Dongola Airport","SD",19.1539001465,30.430099487300001]
["RSS","Damazin Airport","SD",11.785900116000001,34.3367004395]
["ELF","El Fasher Airport","SD",13.6148996353,25.324600219699999]
["GSU","Azaza Airport","SD",14.1330003738,35.317001342799998]
["DNX","Galegu Airport","SD",12.532999992400001,35.067001342799998]
["EGN","Geneina Airport","SD",13.481699943500001,22.467199325599999]
["HEG","Heglig Airport","SD",9.9949329999999996,29.397718000000001]
["KSL","Kassala Airport","SD",15.387499809299999,36.3288002014]
["GBU","Khashm El Girba Airport","SD",14.925000190700001,35.877998352100001]
["KST","Kosti Airport","SD",13.1829996109,32.733001709]
["KDX","Kadugli Airport","SD",11.1379995346,29.7010993958]
["RBX","Rumbek Airport","SS",6.8249998093000004,29.669000625599999]
["MWE","Merowe Airport","SD",18.4500007629,31.833000183100001]
["NUD","En Nahud Airport","SD",12.666999816900001,28.333000183100001]
["UYL","Nyala Airport","SD",12.0535001755,24.956199646000002]
["NHF","New Halfa Airport","SD",15.3556003571,35.727798461900001]
["EBD","El Obeid Airport","SD",13.1532001495,30.2327003479]
["PZU","Port Sudan New International Airport","SD",19.433599472000001,37.234100341800001]
["JUB","Juba Airport","SS",4.872010231,31.601100921600001]
["MAK","Malakal Airport","SS",9.5589704514000005,31.6522006989]
["KRT","Khartoum International Airport","SD",15.589500427200001,32.553199768100001]
["WHF","Wadi Halfa Airport","SD",21.8026981354,31.5215778351]
["WUU","Wau Airport","SS",7.7258300781000004,27.975000381499999]
["ZLX","Zalingei Airport","SD",12.899999618500001,23.482999801599998]
["ARK","Arusha Airport","TZ",-3.3677899836999998,36.633300781300001]
["BKZ","Bukoba Airport","TZ",-1.3320000000000001,31.821200000000001]
["DAR","Mwalimu Julius K. Nyerere International Airport","TZ",-6.8781099319000001,39.202598571800003]
["DOD","Dodoma Airport","TZ",-6.1704401969999996,35.752601623499999]
["IRI","Iringa Airport","TZ",-7.6686301230999998,35.752101898200003]
["TKQ","Kigoma Airport","TZ",-4.8861999999999997,29.6709]
["KIY","Kilwa Masoko Airport","TZ",-8.9329996108999996,39.516998291]
["JRO","Kilimanjaro International Airport","TZ",-3.4294099808,37.074501037600001]
["LDI","Kikwetu Airport","TZ",-9.8511104584000009,39.757801055900003]
["LKY","Lake Manyara Airport","TZ",-3.3763101100999999,35.818298339800002]
["MFA","Mafia Island Airport","TZ",-7.9169998168999998,39.666999816900002]
["MBI","Mbeya Airport","TZ",-8.9169998169000007,33.466999053999999]
["MWN","Mwadui Airport","TZ",-3.5,33.617000579799999]
["XMI","Masasi Airport","TZ",-10.7329998016,38.766998291]
["QSI","Moshi Airport","TZ",-3.3633298873999999,37.326900482200003]
["MYW","Mtwara Airport","TZ",-10.339099883999999,40.181800842299999]
["MUZ","Musoma Airport","TZ",-1.5029999999999999,33.802100000000003]
["MWZ","Mwanza Airport","TZ",-2.4444899559,32.932701110799997]
["NCH","Nachingwea Airport","TZ",-10.357500076299999,38.7792015076]
["JOM","Njombe Airport","TZ",-9.3500003814999992,34.799999237100003]
["PMA","Pemba Airport","TZ",-5.2572598457000002,39.811401367199998]
["SEU","Seronera Airport","TZ",-2.4580600262000001,34.822498321499999]
["SGX","Songea Airport","TZ",-10.6829996109,35.583000183099998]
["SUT","Sumbawanga Airport","TZ",-7.9670000076000003,31.666999816899999]
["SHY","Shinyanga Airport","TZ",-3.6093000000000002,33.503500000000003]
["TBO","Tabora Airport","TZ",-5.0763897896000003,32.833301544199998]
["TGT","Tanga Airport","TZ",-5.0923600197000001,39.071201324500002]
["ZNZ","Zanzibar Airport","TZ",-6.2220201491999996,39.224899292000003]
["RUA","Arua Airport","UG",3.0499999522999999,30.916999816899999]
["EBB","Entebbe International Airport","UG",4.2385999100000002E-2,32.443500518800001]
["ULU","Gulu Airport","UG",2.8055601120000002,32.271800994899998]
["JIN","Jinja Airport","UG",0.44999998810000003,33.200000762899997]
["KBG","Kabalega Falls Airport","UG",2.3263900280000001,31.497800826999999]
["KSE","Kasese Airport","UG",0.18299999829999999,30.100000381499999]
["MBQ","Mbarara Airport","UG",-0.55527800319999998,30.599399566700001]
["KCU","Masindi Airport","UG",1.7580599785,31.736700058]
["PAF","Pakuba Airport","UG",2.2022219999999999,31.554444]
["SRT","Soroti Airport","UG",1.7276899815,33.622798919700003]
["TRY","Tororo Airport","UG",0.68300002810000005,34.166999816900002]
["AMK","Animas Air Park","US",37.203201293900001,-107.869003296]
["BDX","Broadus Airport","US",45.472499849999998,-105.45400239999999]
["FID","Elizabeth Field","US",41.2513008118,-72.031600952100007]
["HCC","Columbia County Airport","US",42.291305549999997,-73.710333329999997]
["GCW","Grand Canyon West Airport","US",35.990398407000001,-113.816001892]
["RKC","Montague-Yreka Rohrer Field","US",41.730400085399999,-122.54599761999999]
["GNF","Gansner Field","US",39.943901062000002,-120.94499969500001]
["AHF","Arapahoe Municipal Airport","US",40.341583329999999,-99.907805550000006]
["GTP","Grants Pass Airport","US",42.510101318399997,-123.388000488]
["GCD","Grand Coulee Dam Airport","US",47.922000885000003,-119.083000183]
["FPY","Perry Foley Airport","US",30.069299699999998,-83.580596920000005]
["JVI","Central Jersey Regional Airport","US",40.524444440000003,-74.598305550000006]
["MMN","Minute Man Air Field","US",42.460385410000001,-71.518011880000003]
["FMU","Florence Municipal Airport","US",43.982799530000001,-124.111000061]
["ATE","Antlers Municipal Airport","US",34.192600250200002,-95.649902343799994]
["AAF","Apalachicola Regional Airport","US",29.727500920000001,-85.027496339999999]
["ABE","Lehigh Valley International Airport","US",40.652099609399997,-75.4408035278]
["ABI","Abilene Regional Airport","US",32.411300659200002,-99.681900024399994]
["ABQ","Albuquerque International Sunport Airport","US",35.040199279799999,-106.6090011597]
["ABR","Aberdeen Regional Airport","US",45.4491004944,-98.421798706100006]
["ABY","Southwest Georgia Regional Airport","US",31.535499572799999,-84.194503784199995]
["ACB","Antrim County Airport","US",44.988601684599999,-85.198402404800007]
["ACK","Nantucket Memorial Airport","US",41.253101350000001,-70.060203549999997]
["ACT","Waco Regional Airport","US",31.611299514799999,-97.230499267599996]
["ACV","California Redwood Coast-Humboldt County Airport","US",40.978099823000001,-124.1090011597]
["ACY","Atlantic City International Airport","US",39.457599639900003,-74.577201843300003]
["ADG","Lenawee County Airport","US",41.867698669399999,-84.077301025400004]
["ADT","Ada Municipal Airport","US",34.804298400900002,-96.671302795399995]
["ADM","Ardmore Municipal Airport","US",34.30301,-97.019634199999999]
["ADS","Addison Airport","US",32.968601226799997,-96.836402893100001]
["ADW","Andrews Air Force Base","US",38.810798644999998,-76.866996765099998]
["AEL","Albert Lea Municipal Airport","US",43.681499479999999,-93.367202759999998]
["AEX","Alexandria International Airport","US",31.327400207499998,-92.549797058099998]
["AFF","USAF Academy Airfield","US",38.969699859999999,-104.81300349999999]
["WSG","Washington County Airport","US",40.136501312299998,-80.290199279800007]
["AFN","Jaffrey Airport Silver Ranch Airport","US",42.805099487299998,-72.002998352099993]
["AFO","Afton Municipal Airport","US",42.711200714100002,-110.942001343]
["AFW","Fort Worth Alliance Airport","US",32.987598419199998,-97.318801879899993]
["AGC","Allegheny County Airport","US",40.354400634800001,-79.930198669399999]
["AGO","Magnolia Municipal Airport","US",33.228000639999998,-93.217002870000002]
["AGS","Augusta Regional At Bush Field","US",33.369899749799998,-81.964500427199994]
["AHC","Amedee Army Air Field","US",40.266201019999997,-120.1529999]
["AHH","Amery Municipal Airport","US",45.281101226799997,-92.375396728499993]
["AHN","Athens Ben Epps Airport","US",33.948600769000002,-83.326301574699997]
["AIA","Alliance Municipal Airport","US",42.053199768100001,-102.80400085399999]
["AID","Anderson Municipal Darlington Field","US",40.108600616499999,-85.612998962399999]
["AIK","Aiken Municipal Airport","US",33.649398803700002,-81.684997558600003]
["AIO","Atlantic Municipal Airport","US",41.407299039999998,-95.046897889999997]
["AIV","George Downer Airport","US",33.106498718300003,-88.197799682600007]
["AIZ","Lee C Fine Memorial Airport","US",38.096000671399999,-92.549499511700006]
["AKO","Colorado Plains Regional Airport","US",40.1755981445,-103.222000122]
["AKC","Akron Fulton International Airport","US",41.037498474099998,-81.466903686500004]
["ALB","Albany International Airport","US",42.748298644999998,-73.801696777299995]
["ALI","Alice International Airport","US",27.740900039700001,-98.026901245100007]
["ALM","Alamogordo White Sands Regional Airport","US",32.839900970499997,-105.99099731450001]
["ALN","St Louis Regional Airport","US",38.8903007507,-90.045997619600001]
["ALO","Waterloo Regional Airport","US",42.557098388699998,-92.400299072300001]
["ALS","San Luis Valley Regional Bergman Field","US",37.434898376500001,-105.866996765]
["ALW","Walla Walla Regional Airport","US",46.094898219999997,-118.28800200000001]
["ALX","Thomas C Russell Field","US",32.914699554400002,-85.962997436500004]
["AMA","Rick Husband Amarillo International Airport","US",35.219398498499999,-101.7060012817]
["AMN","Gratiot Community Airport","US",43.322101592999999,-84.688003539999997]
["AMW","Ames Municipal Airport","US",41.992000580000003,-93.621803279999995]
["ANB","Anniston Metropolitan Airport","US",33.588199619999997,-85.858100890000003]
["AND","Anderson Regional Airport","US",34.494598388699998,-82.709396362299998]
["SLT","Harriet Alexander Field","US",38.5382995605,-106.0490036011]
["ANP","Lee Airport","US",38.942901611300002,-76.568397521999998]
["ANQ","Tri State Steuben County Airport","US",41.639701843300003,-85.083503723099994]
["ANW","Ainsworth Municipal Airport","US",42.579200744600001,-99.992996215800005]
["ANY","Anthony Municipal Airport","US",37.158500671399999,-98.079597473099994]
["AOH","Lima Allen County Airport","US",40.706901550300003,-84.026702880900004]
["AOO","Altoona Blair County Airport","US",40.296398160000003,-78.319999690000003]
["APA","Centennial Airport","US",39.570098880000003,-104.84899900000001]
["APC","Napa County Airport","US",38.213199615500002,-122.28099822999999]
["APF","Naples Municipal Airport","US",26.1525993347,-81.775299072300001]
["APG","Phillips Army Air Field","US",39.466201779999999,-76.168800349999998]
["APH","A P Hill Aaf (Fort A P Hill) Airport","US",38.068901060000002,-77.318298339999998]
["APN","Alpena County Regional Airport","US",45.078098300000001,-83.560302730000004]
["APT","Marion County Brown Field","US",35.060699462899997,-85.585296630900004]
["APV","Apple Valley Airport","US",34.575298309300003,-117.185997009]
["ARA","Acadiana Regional Airport","US",30.037799835200001,-91.883903503400006]
["ARB","Ann Arbor Municipal Airport","US",42.222999572799999,-83.745597839400006]
["ARG","Walnut Ridge Regional Airport","US",36.124666699999999,-90.925111099999995]
["WHT","Wharton Regional Airport","US",29.254299163799999,-96.154403686500004]
["AUZ","Aurora Municipal Airport","US",41.771900176999999,-88.475700378400006]
["ART","Watertown International Airport","US",43.991901397699998,-76.021697997999993]
["ARV","Lakeland-Noble F. Lee Memorial field","US",45.927898409999997,-89.73090363]
["BFT","Beaufort County Airport","US",32.412200927699999,-80.634399414100002]
["ASE","Aspen-Pitkin Co/Sardy Field","US",39.223201750000001,-106.8690033]
["SPZ","Springdale Municipal Airport","US",36.176399230999998,-94.119300842300007]
["ASH","Boire Field","US",42.781700134300003,-71.514801025400004]
["ASL","Harrison County Airport","US",32.520500183099998,-94.307800293]
["ASN","Talladega Municipal Airport","US",33.569900512700002,-86.050903320299994]
["AST","Astoria Regional Airport","US",46.158000946000001,-123.878997803]
["ASX","John F Kennedy Memorial Airport","US",46.548500060000002,-90.918998720000005]
["ASY","Ashley Municipal Airport","US",46.023899078399999,-99.352600097700005]
["ATL","Hartsfield Jackson Atlanta International Airport","US",33.636699676500001,-84.428100585899998]
["ATS","Artesia Municipal Airport","US",32.852500915500002,-104.46800231899999]
["ATW","Appleton International Airport","US",44.258098602300002,-88.519096374499995]
["ATY","Watertown Regional Airport","US",44.914001460000001,-97.154701230000001]
["AUG","Augusta State Airport","US",44.320598602300002,-69.797302246100003]
["AUM","Austin Municipal Airport","US",43.665000919999997,-92.93340302]
["AUN","Auburn Municipal Airport","US",38.954799649999998,-121.08200069999999]
["AUO","Auburn Opelika Robert G. Pitts Airport","US",32.615100859999998,-85.433998110000005]
["AUS","Austin Bergstrom International Airport","US",30.194499969500001,-97.669898986800007]
["AUW","Wausau Downtown Airport","US",44.9262008667,-89.626602172899993]
["AVL","Asheville Regional Airport","US",35.4361991882,-82.541801452599998]
["AVO","Avon Park Executive Airport","US",27.591199870000001,-81.527801510000003]
["AVP","Wilkes Barre Scranton International Airport","US",41.338500976600002,-75.723396301299999]
["AVW","Marana Regional Airport","US",32.4095993042,-111.21800231899999]
["AVX","Catalina Airport","US",33.4048995972,-118.4160003662]
["AWM","West Memphis Municipal Airport","US",35.135101318399997,-90.234397888199993]
["AXG","Algona Municipal Airport","US",43.077899932900003,-94.272003173800002]
["AXN","Chandler Field","US",45.866298675499998,-95.394699096699995]
["AXS","Altus Quartz Mountain Regional Airport","US",34.696399688699998,-99.340301513699998]
["AXV","Neil Armstrong Airport","US",40.493400569999999,-84.298896790000001]
["AXX","Angel Fire Airport","US",36.422000885000003,-105.290000916]
["AYS","Waycross Ware County Airport","US",31.249099731400001,-82.395500183099998]
["AZO","Kalamazoo Battle Creek International Airport","US",42.234901428199997,-85.552101135300006]
["BAB","Beale Air Force Base","US",39.136100769000002,-121.43699646]
["BAD","Barksdale Air Force Base","US",32.501800537100003,-93.662696838399995]
["BAF","Westfield-Barnes Regional Airport","US",42.157798767099997,-72.715599060100004]
["CLU","Columbus Municipal Airport","US",39.2619018555,-85.8963012695]
["BAM","Battle Mountain Airport","US",40.598999023399998,-116.87400054930001]
["BBB","Benson Municipal Airport","US",45.331901550300003,-95.650596618700007]
["BBD","Curtis Field","US",31.179300308199998,-99.323898315400001]
["BKG","Branson Airport","US",36.532082000000003,-93.200543999999994]
["BTN","Marlboro County Jetport H.E. Avent Field","US",34.62170029,-79.734397889999997]
["BBW","Broken Bow Municipal Airport","US",41.4365005493,-99.642196655299998]
["BCB","Virginia Tech Montgomery Executive Airport","US",37.207599639900003,-80.407798767100005]
["BCE","Bryce Canyon Airport","US",37.706401825,-112.144996643]
["BCT","Boca Raton Airport","US",26.378499984699999,-80.107696533199999]
["BDE","Baudette International Airport","US",48.728401184100001,-94.612197875999996]
["BDG","Blanding Municipal Airport","US",37.583301540000001,-109.4830017]
["ILL","Willmar Municipal -John L Rice Field","US",45.117698670000003,-95.130401610000007]
["BDL","Bradley International Airport","US",41.938899993900002,-72.683197021500007]
["BDR","Igor I Sikorsky Memorial Airport","US",41.163501739499999,-73.126197814899996]
["WBU","Boulder Municipal Airport","US",40.039398193399997,-105.225997925]
["BEC","Beech Factory Airport","US",37.694499969500001,-97.214996337900004]
["BED","Laurence G Hanscom Field","US",42.47000122,-71.289001459999994]
["BEH","Southwest Michigan Regional Airport","US",42.128601074199999,-86.428497314500007]
["BFD","Bradford Regional Airport","US",41.803100585899998,-78.640098571799996]
["BFF","Western Neb. Rgnl/William B. Heilig Airport","US",41.874000549999998,-103.5960007]
["BFI","Boeing Field King County International Airport","US",47.529998779300001,-122.3020019531]
["BFL","Meadows Field","US",35.433601379999999,-119.05699920000001]
["BFM","Mobile Downtown Airport","US",30.626800537099999,-88.068099975600006]
["BFR","Virgil I Grissom Municipal Airport","US",38.840000150000002,-86.445396419999994]
["BGD","Hutchinson County Airport","US",35.700901031500003,-101.393997192]
["BGE","Decatur County Industrial Air Park","US",30.9715004,-84.637397770000007]
["BGM","Greater Binghamton/Edwin A Link field","US",42.208698269999999,-75.979797360000006]
["BGR","Bangor International Airport","US",44.807399749799998,-68.828102111800007]
["BHB","Hancock County-Bar Harbor Airport","US",44.450000760000002,-68.361503600000006]
["BHM","Birmingham-Shuttlesworth International Airport","US",33.562900540000001,-86.753501889999995]
["BID","Block Island State Airport","US",41.168098449699997,-71.577796935999999]
["BIE","Beatrice Municipal Airport","US",40.301300048800002,-96.754096984900002]
["BIF","Biggs Army Air Field (Fort Bliss)","US",31.84950066,-106.3799973]
["BIH","Eastern Sierra Regional Airport","US",37.373100280800003,-118.363998413]
["BIL","Billings Logan International Airport","US",45.807701110799997,-108.5429992676]
["BIS","Bismarck Municipal Airport","US",46.772701263400002,-100.7460021973]
["BIX","Keesler Air Force Base","US",30.4104003906,-88.924400329600005]
["BJC","Rocky Mountain Metropolitan Airport","US",39.908798220000001,-105.1169968]
["BJI","Bemidji Regional Airport","US",47.50939941,-94.933700560000005]
["BJJ","Wayne County Airport","US",40.874801635700003,-81.8882980347]
["BKD","Stephens County Airport","US",32.719001769999998,-98.8909988403]
["BKE","Baker City Municipal Airport","US",44.837299346899997,-117.808998108]
["BFK","Buckley Air Force Base","US",39.701698303199997,-104.75199890099999]
["BKL","Burke Lakefront Airport","US",41.517501831099999,-81.683296203599994]
["BKT","Allen C Perkinson Blackstone Army Air Field","US",37.074199676500001,-77.957496643100001]
["BKW","Raleigh County Memorial Airport","US",37.787300109900002,-81.124198913599997]
["BKX","Brookings Regional Airport","US",44.304798126199998,-96.816902160599994]
["BLF","Mercer County Airport","US",37.295799255399999,-81.207702636700006]
["BLH","Blythe Airport","US",33.619201660199998,-114.717002869]
["BLI","Bellingham International Airport","US",48.792800903299998,-122.5380020142]
["BLM","Monmouth Executive Airport","US",40.186901089999999,-74.124900819999993]
["BLU","Blue Canyon Nyack Airport","US",39.275001525900002,-120.709999084]
["BLV","Scott AFB/Midamerica Airport","US",38.545200350000002,-89.835197449999995]
["BMC","Brigham City Airport","US",41.552398681600003,-112.06199646]
["BMG","Monroe County Airport","US",39.1459999084,-86.616699218799994]
["BMI","Central Illinois Regional Airport at Bloomington-Normal","US",40.477100370000002,-88.915901180000006]
["BML","Berlin Regional Airport","US",44.575401309999997,-71.175903320000003]
["BMT","Beaumont Municipal Airport","US",30.070699691800002,-94.215797424300007]
["BNA","Nashville International Airport","US",36.124500274699997,-86.678199768100001]
["BNG","Banning Municipal Airport","US",33.923099517799997,-116.850997925]
["BNL","Barnwell Regional Airport","US",33.257801059999998,-81.388298030000001]
["BNO","Burns Municipal Airport","US",43.591899871800003,-118.955001831]
["BNW","Boone Municipal Airport","US",42.0495986938,-93.847602844199997]
["BOI","Boise Air Terminal/Gowen field","US",43.564399719999997,-116.22299959999999]
["BOS","General Edward Lawrence Logan International Airport","US",42.364299770000002,-71.005203249999994]
["BOW","Bartow Municipal Airport","US",27.943399429300001,-81.783401489300005]
["BGS","Big Spring Mc Mahon-Wrinkle Airport","US",32.212600709999997,-101.5220032]
["BPI","Miley Memorial Field","US",42.585098270000003,-110.1110001]
["WMH","Ozark Regional Airport","US",36.368900299099998,-92.470497131299993]
["BWM","Bowman Municipal Airport","US",46.187000274699997,-103.428001404]
["BPT","Jack Brooks Regional Airport","US",29.950799942,-94.020698547400002]
["BQK","Brunswick Golden Isles Airport","US",31.2588005066,-81.466499328599994]
["BRD","Brainerd Lakes Regional Airport","US",46.398300169999999,-94.138099670000003]
["BRL","Southeast Iowa Regional Airport","US",40.783199310299999,-91.125503539999997]
["BRO","Brownsville South Padre Island International Airport","US",25.906799316400001,-97.425903320299994]
["BRY","Samuels Field","US",37.814300537100003,-85.499603271500007]
["BTF","Skypark Airport","US",40.869400024400001,-111.927001953]
["BTL","Battle Creek Executive Airport at Kellogg Field","US",42.307300567600002,-85.251502990700004]
["BTM","Bert Mooney Airport","US",45.9547996521,-112.49700164790001]
["TTO","Britton Municipal Airport","US",45.815200805700002,-97.743103027299995]
["BTP","Pittsburgh/Butler Regional Airport","US",40.776901250000002,-79.9496994]
["BTR","Baton Rouge Metropolitan Ryan Field","US",30.533199310000001,-91.149597170000007]
["BTV","Patrick Leahy Burlington International Airport","US",44.471900939900003,-73.153297424300007]
["BTY","Beatty Airport","US",36.861099243200002,-116.787002563]
["BUB","Cram Field","US",41.776699066200003,-99.149696350100001]
["BUF","Buffalo Niagara International Airport","US",42.940498349999999,-78.73220062]
["BUM","Butler Memorial Airport","US",38.289798736599998,-94.340103149399994]
["BUR","Bob Hope Airport","US",34.200698852499997,-118.3590011597]
["BFP","Beaver County Airport","US",40.772499084499998,-80.391403198199995]
["BVO","Bartlesville Municipal Airport","US",36.762500760000002,-96.011199950000005]
["MVW","Skagit Regional Airport","US",48.470901489299997,-122.4209976196]
["BLD","Boulder City Municipal Airport","US",35.947498321499999,-114.861000061]
["BVX","Batesville Regional Airport","US",35.7262001,-91.647300720000004]
["BVY","Beverly Regional Airport","US",42.584201812700002,-70.916496276900006]
["BWC","Brawley Municipal Airport","US",32.992900849999998,-115.5169983]
["BWD","Brownwood Regional Airport","US",31.793600082400001,-98.956497192399993]
["BWG","Bowling Green Warren County Regional Airport","US",36.964500427200001,-86.419700622600004]
["BWI","Baltimore/Washington International Thurgood Marshal Airport","US",39.175399779999999,-76.668296810000001]
["WAH","Harry Stern Airport","US",46.244098663300001,-96.607398986800007]
["BXA","George R Carr Memorial Air Field","US",30.813699722300001,-89.864997863799999]
["BXK","Buckeye Municipal Airport","US",33.420398710000001,-112.685997]
["NHZ","Brunswick Executive Airport","US",43.892355100000003,-69.938829699999999]
["BYG","Johnson County Airport","US",44.381099700900002,-106.7220001221]
["BYH","Arkansas International Airport","US",35.964298248299997,-89.944000244099996]
["BYI","Burley Municipal Airport","US",42.542598724400001,-113.7720031738]
["BYS","Bicycle Lake Army Air Field","US",35.280498504599997,-116.629997253]
["BBC","Bay City Municipal Airport","US",28.973300933800001,-95.863502502399996]
["BZN","Bozeman Yellowstone International Airport","US",45.777500150000002,-111.1529999]
["CAD","Wexford County Airport","US",44.275299072300001,-85.4188995361]
["CAE","Columbia Metropolitan Airport","US",33.9388008118,-81.119499206499995]
["CIG","Craig Moffat Airport","US",40.495201110799997,-107.5220031738]
["CAK","Akron Canton Regional Airport","US",40.916099548299997,-81.442199707]
["CAO","Clayton Municipal Airpark","US",36.446201324500002,-103.166999817]
["CAR","Carmelo International Airport","UY",-33.966110229500003,-58.325279235799997]
["CBE","Greater Cumberland Regional Airport","US",39.615398407000001,-78.760902404800007]
["CBF","Council Bluffs Municipal Airport","US",41.259201049799998,-95.760597228999998]
["CBK","Shalz Field","US",39.427501679999999,-101.0469971]
["CBM","Columbus Air Force Base","US",33.643798828100003,-88.443801879899993]
["CCB","Cable Airport","US",34.111598968499997,-117.68800354]
["CCR","Buchanan Field","US",37.989700317400001,-122.056999207]
["CCY","Northeast Iowa Regional Airport","US",43.072601318399997,-92.610801696799996]
["LLX","Caledonia County Airport","US",44.569099426299999,-72.0179977417]
["CDC","Cedar City Regional Airport","US",37.701000213599997,-113.0989990234]
["CDH","Harrell Field","US",33.622798919700003,-92.763397216800001]
["CDK","George T Lewis Airport","US",29.135256764800001,-83.048390150100005]
["CDN","Woodward Field","US",34.2835998535,-80.564903259299996]
["CDR","Chadron Municipal Airport","US",42.837600707999997,-103.095001221]
["CDS","Childress Municipal Airport","US",34.4337997437,-100.288002014]
["CDW","Essex County Airport","US",40.875198364299997,-74.281402587900004]
["CEA","Cessna Acft Field","US",37.648601532000001,-97.2506027222]
["CEC","Jack Mc Namara Field Airport","US",41.780200960000002,-124.2369995]
["CEF","Westover ARB/Metropolitan Airport","US",42.194000240000001,-72.534797670000003]
["CEU","Oconee County Regional Airport","US",34.671901699999999,-82.886497500000004]
["CEV","Mettel Field","US",39.698501586900001,-85.129699707]
["CEW","Bob Sikes Airport","US",30.778799057000001,-86.522102356000005]
["CEY","Kyle Oakley Field","US",36.664600370000002,-88.372802730000004]
["CEZ","Cortez Municipal Airport","US",37.303001403800003,-108.62799835200001]
["CFD","Coulter Field","US",30.715700149500002,-96.331398010300006]
["TZC","Tuscola Area Airport","US",43.4588012695,-83.445503234900002]
["CFT","Greenlee County Airport","US",32.952800750000002,-109.2099991]
["CFV","Coffeyville Municipal Airport","US",37.094001769999998,-95.571899414100002]
["CGE","Cambridge Dorchester Airport","US",38.539299010000001,-76.030403140000004]
["CGF","Cuyahoga County Airport","US",41.565101623499999,-81.486396789599993]
["CGI","Cape Girardeau Regional Airport","US",37.225299835199998,-89.570800781299994]
["CGS","College Park Airport","US",38.980598449699997,-76.922302246100003]
["CGZ","Casa Grande Municipal Airport","US",32.954898834200002,-111.76699829099999]
["CHA","Lovell Field","US",35.035301208500002,-85.203796386700006]
["CHK","Chickasha Municipal Airport","US",35.097400669999999,-97.967697139999999]
["CHO","Charlottesville Albemarle Airport","US",38.1385993958,-78.452903747600004]
["CHS","Charleston Air Force Base-International Airport","US",32.898601530000001,-80.040496829999995]
["CIC","Chico Municipal Airport","US",39.795398710000001,-121.8580017]
["CID","The Eastern Iowa Airport","US",41.884700775100001,-91.710800170900001]
["CIN","Arthur N Neu Airport","US",42.0461997986,-94.789001464799995]
["CIR","Cairo Regional Airport","US",37.0644989014,-89.219596862800003]
["CIU","Chippewa County International Airport","US",46.250801086400003,-84.472396850600006]
["CKA","Kegelman Af Aux Field","US",36.743900299099998,-98.123100280800003]
["CKB","North Central West Virginia Airport","US",39.296600341800001,-80.228103637700002]
["GRM","Grand Marais Cook County Airport","US",47.838298797599997,-90.382896423299997]
["CKM","Fletcher Field","US",34.299701690699997,-90.512298584000007]
["CKN","Crookston Municipal Kirkwood Field","US",47.8417015076,-96.621597289999997]
["CKV","Outlaw Field","US",36.621898651099997,-87.415000915500002]
["CLE","Cleveland Hopkins International Airport","US",41.411701202400003,-81.849800109900002]
["CLI","Clintonville Municipal Airport","US",44.613800048800002,-88.731300353999998]
["CLK","Clinton Regional Airport","US",35.538299559999999,-98.932701109999996]
["CLL","Easterwood Field","US",30.588600159999999,-96.363800049999995]
["CLM","William R Fairchild International Airport","US",48.120201110799997,-123.5]
["CLR","Cliff Hatfield Memorial Airport","US",33.131500244100003,-115.52100372309999]
["CLS","Chehalis Centralia Airport","US",46.676998138400002,-122.98300170900001]
["CLT","Charlotte Douglas International Airport","US",35.214000701899998,-80.943099975600006]
["CLW","Clearwater Air Park","US",27.976699829099999,-82.758697509800001]
["CMH","John Glenn Columbus International Airport","US",39.9980010986,-82.891899108900006]
["CMI","University of Illinois Willard Airport","US",40.039199830000001,-88.278099060000002]
["CMX","Houghton County Memorial Airport","US",47.168399810799997,-88.489097595199993]
["CMY","Sparta Fort Mc Coy Airport","US",43.958301544199998,-90.737899780299998]
["CNH","Claremont Municipal Airport","US",43.370399475100001,-72.368698120100007]
["CNK","Blosser Municipal Airport","US",39.549301147500003,-97.6522979736]
["CNM","Cavern City Air Terminal","US",32.337501525900002,-104.26300048829999]
["CNO","Chino Airport","US",33.974700929999997,-117.637001]
["CNU","Chanute Martin Johnson Airport","US",37.668800353999998,-95.485099792499994]
["CNW","TSTC Waco Airport","US",31.637800216700001,-97.074096679700006]
["CNY","Canyonlands Field","US",38.755001069999999,-109.7549973]
["COD","Yellowstone Regional Airport","US",44.520198821999998,-109.0240020752]
["COE","Coeur D'Alene - Pappy Boyington Field","US",47.774299620000001,-116.8199997]
["COF","Patrick Air Force Base","US",28.234899520900001,-80.610099792499994]
["COI","Merritt Island Airport","US",28.341600418100001,-80.6855010986]
["COM","Coleman Municipal Airport","US",31.8411006927,-99.403602600100001]
["CON","Concord Municipal Airport","US",43.202701570000002,-71.502296450000003]
["COS","City of Colorado Springs Municipal Airport","US",38.805801391599999,-104.7009963989]
["COT","Cotulla-La Salle County","US",28.456699369999999,-99.220298769999999]
["COU","Columbia Regional Airport","US",38.818099975599999,-92.219596862800003]
["CPM","Compton Woodley Airport","US",33.8899993896,-118.2440032959]
["CPR","Casper-Natrona County International Airport","US",42.908000950000002,-106.4639969]
["CPS","St Louis Downtown Airport","US",38.570701599099998,-90.156196594199997]
["HCW","Cheraw Municipal Lynch Bellinger Field","US",34.712898250000002,-79.957000730000004]
["CRE","Grand Strand Airport","US",33.811698913599997,-78.723899841299996]
["CRG","Jacksonville Executive at Craig Airport","US",30.3362998962,-81.514396667499994]
["CRO","Corcoran Airport","US",36.102500915500002,-119.595001221]
["CRP","Corpus Christi International Airport","US",27.770399093599998,-97.501197814899996]
["CLD","Mc Clellan-Palomar Airport","US",33.12829971,-117.2799988]
["CRS","C David Campbell Field Corsicana Municipal Airport","US",32.028099060099997,-96.400596618700007]
["CRT","Z M Jack Stell Field","US",33.178298950200002,-91.880203247099999]
["CRW","Yeager Airport","US",38.373100280800003,-81.593200683600003]
["CRX","Roscoe Turner Airport","US",34.915000915500002,-88.603500366199995]
["CSG","Columbus Metropolitan Airport","US",32.5163002014,-84.938903808600003]
["CSM","Clinton Sherman Airport","US",35.339801788300001,-99.200500488299994]
["CSQ","Creston Municipal Airport","US",41.021400451700003,-94.363296508800005]
["CSV","Crossville Memorial Whitson Field","US",35.951301574699997,-85.084999084499998]
["CTB","Cut Bank Municipal Airport","US",48.6083984375,-112.37599945069999]
["CTY","Cross City Airport","US",29.6354999542,-83.104797363299994]
["CTZ","Sampson County Airport","US",34.975601196299998,-78.364601135300006]
["CUB","Jim Hamilton L.B. Owens Airport","US",33.970500946000001,-80.995201110799997]
["CUH","Cushing Municipal Airport","US",35.949901580800002,-96.773101806599996]
["CVG","Cincinnati Northern Kentucky International Airport","US",39.048801422099999,-84.667800903300005]
["HLI","Hollister Municipal Airport","US",36.8932991028,-121.41000366199999]
["CKK","Sharp County Regional Airport","US",36.26490021,-91.562599180000007]
["CVN","Clovis Municipal Airport","US",34.425098419199998,-103.07900238000001]
["CVO","Corvallis Municipal Airport","US",44.49720001,-123.2900009]
["CVS","Cannon Air Force Base","US",34.382801055900003,-103.3219985962]
["CWA","Central Wisconsin Airport","US",44.7775993347,-89.666801452599998]
["KIP","Kickapoo Downtown Airport","US",33.857799530000001,-98.490402219999993]
["CWF","Chennault International Airport","US",30.2105998993,-93.143203735399993]
["CWI","Clinton Municipal Airport","US",41.8311004639,-90.3291015625]
["CXL","Calexico International Airport","US",32.669498443599998,-115.51300048829999]
["CXO","Conroe/North Houston Regional Airport","US",30.351800918599999,-95.414497375500005]
["CSN","Carson Airport","US",39.192199707,-119.7340011597]
["HAR","Capital City Airport","US",40.2170982361,-76.851501464799995]
["CYS","Cheyenne Regional Jerry Olson Field","US",41.155700680000002,-104.81199650000001]
["CZT","Dimmit County Airport","US",28.522199630700001,-99.823600768999995]
["DAA","Davison Army Air Field","US",38.715000152599998,-77.180999755900004]
["DAB","Daytona Beach International Airport","US",29.179899215700001,-81.058097839400006]
["DAG","Barstow Daggett Airport","US",34.853698729999998,-116.78700259999999]
["DAL","Dallas Love Field","US",32.8470993042,-96.851799011200001]
["DAN","Danville Regional Airport","US",36.572898864700001,-79.336097717300007]
["DAY","James M Cox Dayton International Airport","US",39.902400970499997,-84.219398498499999]
["DBN","W H 'Bud' Barron Airport","US",32.564399719999997,-82.985298159999999]
["DBQ","Dubuque Regional Airport","US",42.402000430000001,-90.709503170000005]
["DCA","Ronald Reagan Washington National Airport","US",38.852100372300001,-77.037696838399995]
["DCU","Pryor Field Regional Airport","US",34.652698516800001,-86.945396423299997]
["DDC","Dodge City Regional Airport","US",37.763401031500003,-99.965599060100004]
["DEC","Decatur Airport","US",39.834598541299997,-88.865699768100001]
["DEH","Decorah Municipal Airport","US",43.275501249999998,-91.739402769999998]
["DEN","Denver International Airport","US",39.861698150599999,-104.672996521]
["DET","Coleman A. Young Municipal Airport","US",42.409198760000002,-83.009902949999997]
["DFI","Defiance Memorial Airport","US",41.337501525900002,-84.428802490199999]
["DFW","Dallas Fort Worth International Airport","US",32.896800994899998,-97.038002014200003]
["DGL","Douglas Municipal Airport","US",31.342599868800001,-109.505996704]
["DGW","Converse County Airport","US",42.797199249999998,-105.3860016]
["DHN","Dothan Regional Airport","US",31.3213005066,-85.449600219700002]
["DHT","Dalhart Municipal Airport","US",36.022598266599999,-102.54699707]
["DIK","Dickinson Theodore Roosevelt Regional Airport","US",46.797401428199997,-102.802001953]
["DKK","Chautauqua County-Dunkirk Airport","US",42.493301389999999,-79.272003170000005]
["DLL","Dillon County Airport","US",34.4491004944,-79.368598938000005]
["DLF","Laughlin Air Force Base","US",29.359500884999999,-100.7779998779]
["DLH","Duluth International Airport","US",46.8420982361,-92.193603515600003]
["DLN","Dillon Airport","US",45.255401611300002,-112.5530014038]
["DLS","Columbia Gorge Regional the Dalles Municipal Airport","US",45.618499755899997,-121.1669998169]
["DMA","Davis Monthan Air Force Base","US",32.1665000916,-110.8830032349]
["DMN","Deming Municipal Airport","US",32.262298584,-107.72100067140001]
["DMO","Sedalia Memorial Airport","US",38.707401275599999,-93.175903320299994]
["DNL","Daniel Field","US",33.466499328600001,-82.039398193400004]
["DNN","Dalton Municipal Airport","US",34.72290039,-84.870201109999996]
["DNS","Denison Municipal Airport","US",41.986400600000003,-95.380699160000006]
["DNV","Vermilion Regional Airport","US",40.19919968,-87.595901490000003]
["DOV","Dover Air Force Base","US",39.129501339999997,-75.466003420000007]
["DPA","Dupage Airport","US",41.907798769999999,-88.248596190000001]
["DPG","Michael AAF (Dugway Proving Ground) Airport","US",40.199401860000002,-112.93699650000001]
["DRA","Desert Rock Airport","US",36.619400024400001,-116.032997131]
["DRI","Beauregard Regional Airport","US",30.831699371300001,-93.339897155800003]
["DRE","Drummond Island Airport","US",46.009300231899999,-83.743896484399997]
["DRO","Durango La Plata County Airport","US",37.151500701899998,-107.753997803]
["DRT","Del Rio International Airport","US",29.374200820900001,-100.927001953]
["DSM","Des Moines International Airport","US",41.534000396700002,-93.663101196300005]
["DSV","Dansville Municipal Airport","US",42.570899963400002,-77.713096618700007]
["DTA","Delta Municipal Airport","US",39.380599975599999,-112.508003235]
["DTL","Detroit Lakes Airport - Wething Field","US",46.825199130000001,-95.885696409999994]
["DTN","Shreveport Downtown Airport","US",32.540199279799999,-93.745002746599994]
["DSI","Destin Fort Walton Beach Airport","US",30.40010071,-86.471496579999993]
["DTW","Detroit Metropolitan Wayne County Airport","US",42.2123985291,-83.353401184099994]
["DUA","Eaker Field","US",33.942298890000004,-96.394500730000004]
["DUC","Halliburton Field","US",34.470901490000003,-97.959899899999996]
["DUG","Bisbee Douglas International Airport","US",31.468999862699999,-109.60399627699999]
["DUJ","DuBois Regional Airport","US",41.178298949999999,-78.898696900000004]
["DVL","Devils Lake Regional Airport","US",48.114200590000003,-98.908798219999994]
["DVN","Davenport Municipal Airport","US",41.610298159999999,-90.58830261]
["NOT","Gnoss Field","US",38.1436004639,-122.5559997559]
["NSL","Slayton Municipal Airport","US",43.986801147500003,-95.7826004028]
["DVT","Phoenix Deer Valley Airport","US",33.688301086400003,-112.083000183]
["DWH","David Wayne Hooks Memorial Airport","US",30.0618000031,-95.552803039599993]
["DXR","Danbury Municipal Airport","US",41.371498107900003,-73.482200622600004]
["DYL","Doylestown Airport","US",40.333000183099998,-75.122299194299998]
["DYS","Dyess Air Force Base","US",32.420799255399999,-99.854598999000004]
["CCG","Crane County Airport","US",31.415100097700002,-102.36299896200001]
["BGQ","Big Lake Airport","US",61.536098480200003,-149.81399536129999]
["BGT","Bagdad Airport","US",34.595901489299997,-113.16999816889999]
["EAN","Phifer Airfield","US",42.055500029999997,-104.92900090000001]
["EAR","Kearney Regional Airport","US",40.727001190000003,-99.006797789999993]
["EAT","Pangborn Memorial Airport","US",47.398899078399999,-120.2070007324]
["EAU","Chippewa Valley Regional Airport","US",44.865798950200002,-91.484298706100006]
["EBS","Webster City Municipal Airport","US",42.436599729999998,-93.868896480000004]
["ECG","Elizabeth City Regional Airport & Coast Guard Air Station","US",36.260601039999997,-76.174598689999996]
["ECP","Northwest Florida Beaches International Airport","US",30.341699999999999,-85.797300000000007]
["ECS","Mondell Field","US",43.885398864700001,-104.3180007935]
["EDE","Northeastern Regional Airport","US",36.027698516800001,-76.567100524899999]
["ETS","Enterprise Municipal Airport","US",31.299699780000001,-85.899902339999997]
["EDW","Edwards Air Force Base","US",34.905399320000001,-117.8840027]
["EED","Needles Airport","US",34.7663002014,-114.6230010986]
["EEN","Dillant Hopkins Airport","US",42.898399353000002,-72.270797729500003]
["EFD","Ellington Airport","US",29.607299804699998,-95.158798217799998]
["EFK","Northeast Kingdom International Airport","US",44.888801574699997,-72.229202270499997]
["EFW","Jefferson Municipal Airport","US",42.010200500000003,-94.342597960000006]
["EGE","Eagle County Regional Airport","US",39.64260101,-106.91799930000001]
["EGI","Duke Field(Eglin Af Aux Nr 3) Airport","US",30.65040016,-86.522903439999993]
["EGV","Eagle River Union Airport","US",45.932300567600002,-89.268302917499994]
["EKA","Murray Field","US",40.803398132300003,-124.1129989624]
["EKI","Elkhart Municipal Airport","US",41.719398498499999,-86.003196716299996]
["EKN","Elkins-Randolph Co-Jennings Randolph Field","US",38.889400479999999,-79.857101439999994]
["EKO","Elko Regional Airport","US",40.824901580800002,-115.7919998169]
["EKX","Addington Field","US",37.686000823999997,-85.925003051800005]
["ELA","Eagle Lake Airport","US",29.6005992889,-96.321899414100002]
["ELD","South Arkansas Regional At Goodwin Field","US",33.221000671399999,-92.813301086400003]
["ELK","Elk City Regional Business Airport","US",35.430801389999999,-99.394302370000005]
["ELM","Elmira Corning Regional Airport","US",42.1599006653,-76.8916015625]
["ELN","Bowers Field","US",47.033000950000002,-120.5309982]
["LYU","Ely Municipal Airport","US",47.824501040000001,-91.830703740000004]
["ELP","El Paso International Airport","US",31.807199480000001,-106.3779984]
["ELY","Ely Airport Yelland Field","US",39.299701689999999,-114.8420029]
["ELZ","Wellsville Municipal ArptTarantine Field","US",42.10950089,-77.989997860000003]
["EMM","Kemmerer Municipal Airport","US",41.8241004944,-110.5569992065]
["EMP","Emporia Municipal Airport","US",38.332099914600001,-96.191200256299993]
["EMT","San Gabriel Valley Airport","US",34.086101532000001,-118.0350036621]
["END","Vance Air Force Base","US",36.339199066200003,-97.916496276900006]
["ENL","Centralia Municipal Airport","US",38.515098571800003,-89.091102600100001]
["ENV","Wendover Airport","US",40.718700408899998,-114.03099822999999]
["ENW","Kenosha Regional Airport","US",42.595699310000001,-87.927803040000001]
["EOK","Keokuk Municipal Airport","US",40.459899902300002,-91.428497314500007]
["EOS","Neosho Hugh Robinson Airport","US",36.810798644999998,-94.391700744600001]
["EPH","Ephrata Municipal Airport","US",47.307598110000001,-119.51599880000001]
["EDK","Captain Jack Thomas El Dorado Airport","US",37.774101257300003,-96.817596435499993]
["ERI","Erie International Tom Ridge Field","US",42.083127013400002,-80.173866748799995]
["ERR","Errol Airport","US",44.792499542199998,-71.164199829099999]
["ERV","Kerrville Municipal Louis Schreiner Field","US",29.976699829099999,-99.085700988799999]
["ESC","Delta County Airport","US",45.722698211699999,-87.093696594199997]
["ESF","Esler Regional Airport","US",31.394899368299999,-92.295799255399999]
["ESN","Easton Newnam Field","US",38.804199218800001,-76.069000244099996]
["EST","Estherville Municipal Airport","US",43.407398219999997,-94.746398929999998]
["ESW","Easton State Airport","US",47.254199981699998,-121.1859970093]
["ETB","West Bend Municipal Airport","US",43.4221992493,-88.127899169900004]
["ETN","Eastland Municipal Airport","US",32.413501739499999,-98.809799194299998]
["EUF","Weedon Field","US",31.951299667400001,-85.128898620599998]
["EUG","Mahlon Sweet Field","US",44.124599456799999,-123.2119979858]
["EVM","Eveleth Virginia Municipal Airport","US",47.425098419999998,-92.498497009999994]
["EVV","Evansville Regional Airport","US",38.036998748800002,-87.532402038599997]
["EVW","Evanston-Uinta County Airport-Burns Field","US",41.274799350000002,-111.0350037]
["EWB","New Bedford Regional Airport","US",41.676101684599999,-70.956901550300003]
["EWK","Newton City-County Airport","US",38.058200836200001,-97.274497985799997]
["EWN","Coastal Carolina Regional Airport","US",35.073001861599998,-77.042900085400007]
["EWR","Newark Liberty International Airport","US",40.6925010681,-74.168701171899997]
["EYW","Key West International Airport","US",24.556100845300001,-81.759597778300005]
["FAF","Felker Army Air Field","US",37.132499694800003,-76.608802795399995]
["FAM","Farmington Regional Airport","US",37.761100769999999,-90.428596499999998]
["FAR","Hector International Airport","US",46.920700073200003,-96.8158035278]
["FAT","Fresno Yosemite International Airport","US",36.776199340799998,-119.7180023193]
["FAY","Fayetteville Regional Grannis Field","US",34.991199493400003,-78.8803024292]
["FBG","Simmons Army Air Field","US",35.131801609999997,-78.936698910000004]
["FBL","Faribault Municipal Airport","US",44.324699401899998,-93.310798645000006]
["FBR","Fort Bridger Airport","US",41.391899108899999,-110.4069976807]
["FBY","Fairbury Municipal Airport","US",40.182998657200002,-97.169296264600007]
["FCH","Fresno Chandler Executive Airport","US",36.73239899,-119.8199997]
["FCM","Flying Cloud Airport","US",44.827201843300003,-93.457099914599993]
["FCS","Butts AAF (Fort Carson) Air Field","US",38.678398129999998,-104.75700380000001]
["FCY","Forrest City Municipal Airport","US",34.942001342799998,-90.775001525899995]
["FDK","Frederick Municipal Airport","US",39.417598724400001,-77.374298095699999]
["FDR","Frederick Regional Airport","US",34.352001190000003,-98.983901979999999]
["FDY","Findlay Airport","US",41.013500213599997,-83.668701171899997]
["FEP","Albertus Airport","US",42.246200561499997,-89.582000732400004]
["FET","Fremont Municipal Airport","US",41.449100489999999,-96.520202639999994]
["FFA","First Flight Airport","US",36.018199920699999,-75.671302795399995]
["FFL","Fairfield Municipal Airport","US",41.053298950200002,-91.978897094700002]
["FFM","Fergus Falls Municipal Einar Mickelson Field","US",46.284400939999998,-96.156700130000004]
["FFO","Wright Patterson Air Force Base","US",39.8260993958,-84.048301696799996]
["FFT","Capital City Airport","US",38.182498930000001,-84.904701230000001]
["MSC","Falcon Field","US",33.460800170900001,-111.7279968262]
["FHB","Fernandina Beach Municipal Airport","US",30.611799240100002,-81.461196899399994]
["FRD","Friday Harbor Airport","US",48.521999359100001,-123.024002075]
["FHU","Sierra Vista Municipal Libby Army Air Field","US",31.588499069200001,-110.34400177000001]
["FKL","Venango Regional Airport","US",41.377899169899997,-79.8603973389]
["FKN","Franklin Municipal John Beverly Rose Airport","US",36.698101043699999,-76.903800964400006]
["FLD","Fond du Lac County Airport","US",43.771198272699998,-88.488403320299994]
["FLG","Flagstaff Pulliam Airport","US",35.138500209999997,-111.67099760000001]
["FLL","Fort Lauderdale Hollywood International Airport","US",26.072599410999999,-80.152702331499995]
["FLO","Florence Regional Airport","US",34.185398101799997,-79.723899841299996]
["FLP","Marion County Regional Airport","US",36.290901179999999,-92.590301510000003]
["FLV","Sherman Army Air Field","US",39.368301391599999,-94.914703369099996]
["FLX","Fallon Municipal Airport","US",39.499099731400001,-118.74900054930001]
["FME","Tipton Airport","US",39.085399627699999,-76.759399414100002]
["FMH","Cape Cod Coast Guard Air Station","US",41.658401489299997,-70.521400451700003]
["FMN","Four Corners Regional Airport","US",36.741199493400003,-108.2300033569]
["FMY","Page Field","US",26.58659935,-81.863296508800005]
["FNL","Northern Colorado Regional Airport","US",40.4518013,-105.011001587]
["FNT","Bishop International Airport","US",42.9654006958,-83.743598938000005]
["FOD","Fort Dodge Regional Airport","US",42.551498410000001,-94.192596440000003]
["FOE","Topeka Regional Airport","US",38.950901031500003,-95.663597106899999]
["FOK","Francis S Gabreski Airport","US",40.843700408899998,-72.631797790500002]
["FIL","Fillmore Municipal Airport","US",38.958301540000001,-112.362999]
["FPR","Treasure Coast International Airport","US",27.495100019999999,-80.368301389999999]
["FRG","Republic Airport","US",40.728801727300002,-73.413398742699997]
["FRH","French Lick Municipal Airport","US",38.506198883099998,-86.6369018555]
["FRI","Marshall Army Air Field","US",39.055301669999999,-96.764503480000002]
["FRM","Fairmont Municipal Airport","US",43.643901825,-94.415603637700002]
["FRR","Front Royal Warren County Airport","US",38.917499542199998,-78.253501892100005]
["FSD","Joe Foss Field Airport","US",43.582000732399997,-96.741897582999997]
["FSI","Henry Post Army Air Field (Fort Sill)","US",34.649799350000002,-98.40219879]
["FSK","Fort Scott Municipal Airport","US",37.798400878899997,-94.769401550300003]
["FSM","Fort Smith Regional Airport","US",35.336601257300003,-94.367401122999993]
["FST","Fort Stockton Pecos County Airport","US",30.9157009125,-102.9160003662]
["FSU","Fort Sumner Municipal Airport","US",34.4833984375,-104.21700286870001]
["FMS","Fort Madison Municipal Airport","US",40.659301757800002,-91.326797485399993]
["FTK","Godman Army Air Field","US",37.907100677499997,-85.9720993042]
["FTW","Fort Worth Meacham International Airport","US",32.819801330600001,-97.362396240199999]
["FTY","Fulton County Airport Brown Field","US",33.779098510700003,-84.521400451700003]
["FUL","Fullerton Municipal Airport","US",33.872001647899999,-117.980003357]
["WFK","Northern Aroostook Regional Airport","US",47.285499572799999,-68.312797546400006]
["FWA","Fort Wayne International Airport","US",40.978500369999999,-85.195098880000003]
["FXE","Fort Lauderdale Executive Airport","US",26.1972999573,-80.170700073199995]
["FXY","Forest City Municipal Airport","US",43.234699249999998,-93.624099729999998]
["FYM","Fayetteville Municipal Airport","US",35.059700012199997,-86.564002990700004]
["FYV","Drake Field","US",36.005100250200002,-94.170097351099997]
["GAB","Gabbs Airport","US",38.924098968499997,-117.95899963399999]
["GAD","Northeast Alabama Regional Airport","US",33.972599029500003,-86.088996887199997]
["GAG","Gage Airport","US",36.295501709,-99.776397705099996]
["GAI","Montgomery County Airpark","US",39.168300628700003,-77.166000366199995]
["GBD","Great Bend Municipal Airport","US",38.344299316399997,-98.859199523900003]
["GBG","Galesburg Municipal Airport","US",40.937999725300003,-90.431098938000005]
["GBR","Walter J. Koladza Airport","US",42.18420029,-73.403198239999995]
["GCC","Northeast Wyoming Regional Airport","US",44.348899841300003,-105.53900146479999]
["JDA","Grant Co Regional/Ogilvie Field","US",44.40420151,-118.96299740000001]
["GCK","Garden City Regional Airport","US",37.927501678500001,-100.7239990234]
["GCN","Grand Canyon National Park Airport","US",35.952400207499998,-112.1470031738]
["GCY","Greeneville Greene County Municipal Airport","US",36.193000789999999,-82.815101619999993]
["GDM","Gardner Municipal Airport","US",42.549999237100003,-72.016098022500003]
["GDV","Dawson Community Airport","US",47.138698580000003,-104.80699920000001]
["GDW","Gladwin Zettel Memorial Airport","US",43.970600128199997,-84.474998474100005]
["GDY","Grundy Municipal Airport","US",37.2323989868,-82.125]
["GED","Delaware Coastal Airport","US",38.689201349999998,-75.358901979999999]
["GEG","Spokane International Airport","US",47.619899749799998,-117.533996582]
["GEY","South Big Horn County Airport","US",44.516799929999998,-108.0830002]
["GFK","Grand Forks International Airport","US",47.949298858600002,-97.176101684599999]
["GFL","Floyd Bennett Memorial Airport","US",43.341201782200002,-73.610298156699997]
["GGE","Georgetown County Airport","US",33.311698913599997,-79.319602966299996]
["GGG","East Texas Regional Airport","US",32.383998870799999,-94.711502075200002]
["GGW","Wokal Field Glasgow International Airport","US",48.212501525900002,-106.6149978638]
["GHM","Centerville Municipal Airport","US",35.8373985291,-87.445396423299997]
["IDH","Idaho County Airport","US",45.942600249999998,-116.1230011]
["GIF","Winter Haven's Gilbert Airport","US",28.062900540000001,-81.753303529999997]
["GJT","Grand Junction Regional Airport","US",39.122398376500001,-108.527000427]
["MEJ","Port Meadville Airport","US",41.626499180000003,-80.21469879]
["GKT","Gatlinburg Pigeon Forge Airport","US",35.857799530000001,-83.528701782200002]
["GLD","Renner Field-Goodland Municipal Airport","US",39.370601649999998,-101.6989975]
["GLE","Gainesville Municipal Airport","US",33.651401519799997,-97.196998596200004]
["GLH","Greenville Mid-Delta Airport","US",33.482898712199997,-90.985603332500006]
["GLR","Gaylord Regional Airport","US",45.013500213599997,-84.703598022500003]
["GLS","Scholes International At Galveston Airport","US",29.2653007507,-94.8603973389]
["GLW","Glasgow Municipal Airport","US",37.031799319999998,-85.953697199999993]
["GMU","Greenville Downtown Airport","US",34.847900390600003,-82.349998474100005]
["GNG","Gooding Municipal Airport","US",42.91719818,-114.76499939999999]
["GNT","Grants Milan Municipal Airport","US",35.167301178000002,-107.90200042719999]
["GNV","Gainesville Regional Airport","US",29.690099716199999,-82.271797180199997]
["GOK","Guthrie-Edmond Regional Airport","US",35.849800109999997,-97.41560364]
["GON","Groton New London Airport","US",41.3301010132,-72.045097351099997]
["FCA","Glacier Park International Airport","US",48.3105010986,-114.2559967041]
["GPT","Gulfport Biloxi International Airport","US",30.407300949100001,-89.070098877000007]
["GPZ","Grand Rapids Itasca Co-Gordon Newstrom field","US",47.211101530000001,-93.509803770000005]
["GQQ","Galion Municipal Airport","US",40.753398895300002,-82.723800659199995]
["GRB","Austin Straubel International Airport","US",44.485099792500002,-88.129600524899999]
["GRD","Greenwood County Airport","US",34.2486991882,-82.159103393600006]
["GRE","Greenville Airport","US",38.836200714100002,-89.378402710000003]
["GRF","Gray Army Air Field","US",47.079200739999997,-122.5810013]
["GRI","Central Nebraska Regional Airport","US",40.967498779300001,-98.309600830099996]
["GRK","Robert Gray  Army Air Field Airport","US",31.067199707,-97.828903198199995]
["GRN","Gordon Municipal Airport","US",42.805999755899997,-102.1750030518]
["GRR","Gerald R. Ford International Airport","US",42.880798339999998,-85.522796630000002]
["GSB","Seymour Johnson Air Force Base","US",35.339401250000002,-77.96060181]
["GSH","Goshen Municipal Airport","US",41.526401519799997,-85.792900085400007]
["GSO","Piedmont Triad International Airport","US",36.097801208500002,-79.937301635699995]
["GSP","Greenville Spartanburg International Airport","US",34.895698547400002,-82.218902587900004]
["GTB","Wheeler Sack Army Air Field","US",44.055599209999997,-75.719497680000003]
["GTF","Great Falls International Airport","US",47.481998439999998,-111.37100220000001]
["GTG","Grantsburg Municipal Airport","US",45.798099517799997,-92.664398193400004]
["GTR","Golden Triangle Regional Airport","US",33.450298309300003,-88.591400146500007]
["GUC","Gunnison Crested Butte Regional Airport","US",38.533901210000003,-106.9329987]
["GUP","Gallup Municipal Airport","US",35.511100769000002,-108.789001465]
["GUS","Grissom ARB Airport","US",40.648101806600003,-86.152099609399997]
["GUY","Guymon Municipal Airport","US",36.685100555399998,-101.5080032349]
["GVL","Lee Gilmer Memorial Airport","US",34.272598270000003,-83.830200199999993]
["GVT","Majors Airport","US",33.067798614499999,-96.065299987800003]
["GWO","Greenwood Leflore Airport","US",33.494300842299999,-90.084701538100006]
["GWS","Glenwood Springs Municipal Airport","US",39.508300781300001,-107.3109970093]
["GXY","Greeley Weld County Airport","US",40.437400817899999,-104.6330032349]
["GDC","Donaldson Center Airport","US",34.758300781300001,-82.376403808600003]
["PNX","North Texas Rgnl/Perrin Field","US",33.714099883999999,-96.673698425300003]
["GYR","Phoenix Goodyear Airport","US",33.4225006104,-112.37599945069999]
["GYY","Gary Chicago International Airport","US",41.616298675499998,-87.412803649899999]
["HAB","Marion County Rankin Fite Airport","US",34.117599490000003,-87.998199459999995]
["HAF","Half Moon Bay Airport","US",37.513401031500003,-122.50099945069999]
["HAI","Three Rivers Municipal Dr Haines Airport","US",41.959800720200001,-85.593399047899993]
["HAO","Butler Co Regional Airport","US",39.363800048800002,-84.522003173800002]
["HBG","Hattiesburg Bobby L Chain Municipal Airport","US",31.264799119999999,-89.25279999]
["HBR","Hobart Regional Airport","US",34.99129868,-99.051399230000001]
["HDE","Brewster Field","US",40.452098849999999,-99.336502080000002]
["HDN","Yampa Valley Airport","US",40.481201169999999,-107.21800229999999]
["HEE","Thompson Robbins Airport","US",34.576499939000001,-90.675903320299994]
["MNZ","Manassas Regional Harry P. Davis field","US",38.721401210000003,-77.515403750000004]
["HEZ","Hardy Anders Field Natchez Adams County Airport","US",31.6137008667,-91.297302246100003]
["HFD","Hartford Brainard Airport","US",41.736698150599999,-72.649398803699995]
["HFF","Mackall Army Air Field","US",35.036499020000001,-79.497497559999999]
["HGR","Hagerstown Regional Richard A Henson Field","US",39.707901,-77.729499820000001]
["HHR","Jack Northrop Field Hawthorne Municipal Airport","US",33.922798156699997,-118.3349990845]
["HUJ","Stan Stamper Municipal Airport","US",34.034801479999999,-95.541900630000001]
["HIB","Range Regional Airport","US",47.386600489999999,-92.838996890000004]
["HIE","Mount Washington Regional Airport","US",44.367599487299998,-71.5445022583]
["HIF","Hill Air Force Base","US",41.123901367199998,-111.97299957280001]
["HII","Lake Havasu City Airport","US",34.571098329999998,-114.3580017]
["HIO","Portland Hillsboro Airport","US",45.540401459999998,-122.9499969]
["HKA","Blytheville Municipal Airport","US",35.940399169899997,-89.830802917499994]
["HKS","Hawkins Field","US",32.334499360000002,-90.222198489999997]
["HKY","Hickory Regional Airport","US",35.74110031,-81.389503480000002]
["HLB","Batesville Airport","US",39.344501495400003,-85.258300781299994]
["HLC","Hill City Municipal Airport","US",39.378799440000002,-99.831497189999993]
["HLG","Wheeling Ohio County Airport","US",40.174999237100003,-80.6463012695]
["HLM","Park Township Airport","US",42.7958984375,-86.162002563499996]
["HLN","Helena Regional Airport","US",46.606800079300001,-111.98300170900001]
["HLR","Yoakum–DeFrenn Army Heliport","US",31.138700485200001,-97.714500427199994]
["HMN","Holloman Air Force Base","US",32.852500915500002,-106.1070022583]
["HMT","Hemet Ryan Airport","US",33.7340011597,-117.02300262449999]
["HNB","Huntingburg Airport","US",38.2490005493,-86.953697204600005]
["HSH","Henderson Executive Airport","US",35.972801208500002,-115.13400268549999]
["HOB","Lea County Regional Airport","US",32.6875,-103.2170029]
["HON","Huron Regional Airport","US",44.385200500499998,-98.228500366199995]
["HOP","Campbell AAF (Fort Campbell) Air Field","US",36.668598175,-87.496200561500004]
["HOT","Memorial Field","US",34.478000640899999,-93.096199035599994]
["HOU","William P Hobby Airport","US",29.645399090000002,-95.278900149999998]
["HPN","Westchester County Airport","US",41.067001342799998,-73.707603454600005]
["HPT","Hampton Municipal Airport","US",42.723701477100001,-93.226303100600006]
["HPY","Baytown Airport","US",29.786100387600001,-94.952697753899997]
["HQM","Bowerman Airport","US",46.971199035600002,-123.93699646]
["HES","Hermiston Municipal Airport","US",45.828201293900001,-119.25900268549999]
["HRL","Valley International Airport","US",26.228500366199999,-97.654403686500004]
["HRO","Boone County Airport","US",36.261501312299998,-93.154701232899995]
["HSB","Harrisburg Raleigh Airport","US",37.811298370000003,-88.5503006]
["HNC","Billy Mitchell Airport","US",35.232799530000001,-75.617797851600002]
["HSI","Hastings Municipal Airport","US",40.605300903299998,-98.427902221699995]
["HSP","Ingalls Field","US",37.951400759999999,-79.833900450000002]
["HST","Homestead ARB Airport","US",25.488599780000001,-80.383598329999998]
["HSV","Huntsville International Carl T Jones Field","US",34.637199401899998,-86.775100707999997]
["HTH","Hawthorne Industrial Airport","US",38.544399261499997,-118.63400268549999]
["HTL","Roscommon County - Blodgett Memorial Airport","US",44.359798429999998,-84.671096800000001]
["HTS","Tri-State/Milton J. Ferguson Field","US",38.366699220000001,-82.557998659999996]
["HTW","Lawrence County Airpark","US",38.419300079300001,-82.494300842300007]
["HUA","Redstone Army Air Field","US",34.67869949,-86.684799190000007]
["HUF","Terre Haute International Hulman Field","US",39.451499939000001,-87.307601928699995]
["HUL","Houlton International Airport","US",46.123100280800003,-67.792098999000004]
["HUM","Houma Terrebonne Airport","US",29.5664997101,-90.660400390600003]
["HUT","Hutchinson Municipal Airport","US",38.065498352100001,-97.860603332500006]
["HVE","Hanksville Airport","US",38.417999267600003,-110.7040023804]
["HVN","Tweed New Haven Airport","US",41.263698580000003,-72.886802669999994]
["HVR","Havre City County Airport","US",48.542999270000003,-109.762001]
["HVS","Hartsville Regional Airport","US",34.403099060099997,-80.119201660200005]
["HWD","Hayward Executive Airport","US",37.659198760999999,-122.12200164790001]
["HWO","North Perry Airport","US",26.001199722300001,-80.240699768100001]
["WSH","Brookhaven Airport","US",40.821899414100002,-72.869400024399994]
["HHH","Hilton Head Airport","US",32.224399566700001,-80.697502136200001]
["HYA","Cape Cod Gateway Airport","US",41.669300079999999,-70.280403140000004]
["HYR","Sawyer County Airport","US",46.025199890099998,-91.444297790500002]
["HYS","Hays Regional Airport","US",38.842201230000001,-99.273200990000007]
["HZL","Hazleton Municipal Airport","US",40.986801147500003,-75.994903564500007]
["JFN","Northeast Ohio Regional Airport","US",41.777999877900001,-80.695503234900002]
["IAB","Mc Connell Air Force Base","US",37.621898649999999,-97.268203740000004]
["IAD","Washington Dulles International Airport","US",38.944499970000003,-77.455802919999996]
["IAG","Niagara Falls International Airport","US",43.107299804699998,-78.946197509800001]
["IAH","George Bush Intercontinental Houston Airport","US",29.9843997955,-95.341400146500007]
["ICL","Schenck Field","US",40.721801759999998,-95.026397709999998]
["ICT","Wichita Mid Continent Airport","US",37.6498985291,-97.433097839400006]
["IDA","Idaho Falls Regional Airport","US",43.514598846399998,-112.0709991455]
["IDG","Ida Grove Municipal Airport","US",42.332599639900003,-95.444900512700002]
["IDI","Indiana County/Jimmy Stewart Fld/ Airport","US",40.632198330000001,-79.105499269999996]
["IDP","Independence Municipal Airport","US",37.158401489299997,-95.778396606399994]
["XPR","Pine Ridge Airport","US",43.022499084499998,-102.511001587]
["IFA","Iowa Falls Municipal Airport","US",42.4707984924,-93.269996643100001]
["IFP","Laughlin Bullhead International Airport","US",35.157398219999997,-114.5599976]
["IGM","Kingman Airport","US",35.259498596199997,-113.93800354]
["IJX","Jacksonville Municipal Airport","US",39.774600982700001,-90.238296508800005]
["IKK","Greater Kankakee Airport","US",41.071399688699998,-87.846298217799998]
["ILE","Skylark Field","US",31.085800170900001,-97.686500549300007]
["ILG","New Castle Airport","US",39.67869949,-75.606498720000005]
["ILM","Wilmington International Airport","US",34.270599365199999,-77.902603149399994]
["ILN","Wilmington Air Park","US",39.427898407000001,-83.792098999000004]
["IML","Imperial Municipal Airport","US",40.509300230000001,-101.62100220000001]
["IMM","Immokalee Regional Airport","US",26.433200840000001,-81.401000980000006]
["MDN","Madison Municipal Airport","US",38.75889969,-85.465499879999996]
["IMT","Ford Airport","US",45.818401336699999,-88.114501953100003]
["IND","Indianapolis International Airport","US",39.717300414999997,-86.294403076199998]
["INK","Winkler County Airport","US",31.7796001434,-103.2009963989]
["INL","Falls International Airport","US",48.5662002563,-93.403099060100004]
["INS","Creech Air Force Base","US",36.587200164800002,-115.672996521]
["INT","Smith Reynolds Airport","US",36.133701324500002,-80.222000122099999]
["INW","Winslow Lindbergh Regional Airport","US",35.021900176999999,-110.72299957280001]
["IOW","Iowa City Municipal Airport","US",41.639198303199997,-91.5465011597]
["IPL","Imperial County Airport","US",32.834201812700002,-115.57900238000001]
["IPT","Williamsport Regional Airport","US",41.241798400900002,-76.921096801800005]
["IRK","Kirksville Regional Airport","US",40.093498230000002,-92.544898986800007]
["IRS","Kirsch Municipal Airport","US",41.813301090000003,-85.439002990000006]
["ISM","Kissimmee Gateway Airport","US",28.289800643900001,-81.437103271500007]
["ISN","Sloulin Field International Airport","US",48.177898407000001,-103.64199829099999]
["ISO","Kinston Regional Jetport At Stallings Field","US",35.331401825,-77.608802795399995]
["ISP","Long Island Mac Arthur Airport","US",40.795200350000002,-73.100196839999995]
["ISQ","Schoolcraft County Airport","US",45.974601749999998,-86.171798710000004]
["ISW","Alexander Field South Wood County Airport","US",44.360298156699997,-89.838996887199997]
["ITH","Ithaca Tompkins Regional Airport","US",42.491001129200001,-76.458396911600005]
["AZA","Phoenix-Mesa-Gateway Airport","US",33.307800290000003,-111.6549988]
["IWD","Gogebic Iron County Airport","US",46.527500152599998,-90.131401061999995]
["ISS","Wiscasset Airport","US",43.961399078399999,-69.712600707999997]
["IWS","West Houston Airport","US",29.818199157700001,-95.672599792499994]
["JCI","New Century Aircenter Airport","US",38.830898284900002,-94.890296935999999]
["IYK","Inyokern Airport","US",35.658798220000001,-117.83000180000001]
["SQA","Santa Ynez Airport","US",34.606800079999999,-120.07599639999999]
["FRY","Eastern Slopes Regional Airport","US",43.991100311300002,-70.947898864699994]
["JAC","Jackson Hole Airport","US",43.607299804699998,-110.7379989624]
["JAN","Jackson Evers International Airport","US",32.3111991882,-90.075897216800001]
["JAS","Jasper County-Bell Field","US",30.885700230000001,-94.034896849999996]
["JAX","Jacksonville International Airport","US",30.494100570699999,-81.687896728499993]
["JBR","Jonesboro Municipal Airport","US",35.831699371299997,-90.646400451700003]
["JCT","Kimble County Airport","US",30.5112991333,-99.763496398900003]
["JDN","Jordan Airport","US",47.3288002014,-106.95300292970001]
["JEF","Jefferson City Memorial Airport","US",38.591201782200002,-92.156097412099996]
["JFK","John F Kennedy International Airport","US",40.639801030000001,-73.778900149999998]
["JHW","Chautauqua County-Jamestown Airport","US",42.153400419999997,-79.25800323]
["GUF","Jack Edwards Airport","US",30.290500640000001,-87.671798710000004]
["JLN","Joplin Regional Airport","US",37.151798248299997,-94.498298645000006]
["JMS","Jamestown Regional Airport","US",46.929698940000002,-98.678199770000006]
["JOT","Joliet Regional Airport","US",41.51779938,-88.175498959999999]
["HTO","Town of East Hampton Airport","US",40.959598540000002,-72.251800540000005]
["USA","Concord Regional Airport","US",35.387798309300003,-80.709098815900006]
["JKV","Cherokee County Airport","US",31.869300842299999,-95.2173995972]
["JST","John Murtha Johnstown Cambria County Airport","US",40.316101074199999,-78.833900451700003]
["JVL","Southern Wisconsin Regional Airport","US",42.620300293,-89.041603088399995]
["JXN","Jackson County Reynolds Field","US",42.259799957299997,-84.459396362299998]
["KIC","Mesa Del Rey Airport","US",36.228000640899999,-121.12200164790001]
["KLS","Southwest Washington Regional Airport","US",46.118000030499999,-122.898002625]
["KNB","Kanab Municipal Airport","US",37.011100769000002,-112.53099822999999]
["BXS","Borrego Valley Airport","US",33.258998870799999,-116.32099914600001]
["LAA","Lamar Municipal Airport","US",38.069698333700003,-102.68800354]
["LAF","Purdue University Airport","US",40.412300109900002,-86.9368972778]
["LAL","Lakeland Linder Regional Airport","US",27.988899231000001,-82.0186004639]
["LAM","Los Alamos Airport","US",35.879798889200003,-106.26899719239999]
["LAN","Capital Region International Airport","US",42.778701782200002,-84.587402343799994]
["LAR","Laramie Regional Airport","US",41.312099456799999,-105.6750030518]
["LAS","Harry Reid International Airport","US",36.08010101,-115.15200040000001]
["LAW","Lawton Fort Sill Regional Airport","US",34.567699432399998,-98.416603088399995]
["LAX","Los Angeles International Airport","US",33.942501069999999,-118.4079971]
["LBB","Lubbock Preston Smith International Airport","US",33.663600921600001,-101.8229980469]
["LBE","Arnold Palmer Regional Airport","US",40.275901789999999,-79.404800420000001]
["LBF","North Platte Regional Airport Lee Bird Field","US",41.126201629999997,-100.6839981]
["LBL","Liberal Mid-America Regional Airport","US",37.0442009,-100.9599991]
["LBT","Lumberton Municipal Airport","US",34.609901428199997,-79.059402465800005]
["LJN","Texas Gulf Coast Regional Airport","US",29.108600616499999,-95.462097168]
["LCH","Lake Charles Regional Airport","US",30.1261005402,-93.223297119099996]
["LCI","Laconia Municipal Airport","US",43.572700500499998,-71.4188995361]
["LCK","Rickenbacker International Airport","US",39.8138008118,-82.927803039599993]
["LCQ","Lake City Gateway Airport","US",30.181999206499999,-82.576896667499994]
["LDJ","Linden Airport","US",40.617401123,-74.244598388699998]
["LDM","Mason County Airport","US",43.962501529999997,-86.407897950000006]
["LEB","Lebanon Municipal Airport","US",43.626098632800002,-72.304199218799994]
["LEE","Leesburg International Airport","US",28.82309914,-81.808700560000005]
["LEM","Lemmon Municipal Airport","US",45.918701171899997,-102.10600280760001]
["LEW","Auburn Lewiston Municipal Airport","US",44.048500060999999,-70.283500671400006]
["LEX","Blue Grass Airport","US",38.036499023399998,-84.605903625500005]
["LFI","Langley Air Force Base","US",37.082901001000003,-76.360496521000002]
["LFK","Angelina County Airport","US",31.233999252299999,-94.75]
["LFT","Lafayette Regional Airport","US",30.20529938,-91.987602229999993]
["LGA","La Guardia Airport","US",40.77719879,-73.872596740000006]
["LGB","Long Beach /Daugherty Field/ Airport","US",33.817699429999998,-118.15200040000001]
["LGC","Lagrange Callaway Airport","US",33.008899688699998,-85.072601318400004]
["LGD","La Grande Union County Airport","US",45.290199279799999,-118.00700378419999]
["LGF","Laguna AAF (Yuma Proving Ground) Airfield","US",32.86000061,-114.3970032]
["LGU","Logan Cache Airport","US",41.7911987305,-111.85199737550001]
["LHV","William T. Piper Memorial Airport","US",41.135601039999997,-77.422302250000001]
["LIY","Wright Aaf (Fort Stewart)/Midcoast Regional Airport","US",31.889099120000001,-81.562301640000001]
["LFN","Triangle North Executive Airport","US",36.023300170900001,-78.330299377399996]
["LIC","Limon Municipal Airport","US",39.274799346899997,-103.6660003662]
["LIT","Adams Field","US",34.729400634800001,-92.224296569800003]
["LKP","Lake Placid Airport","US",44.264499664299997,-73.961898803699995]
["LOW","Louisa County-Freeman field","US",38.009799960000002,-77.970100400000007]
["LKV","Lake County Airport","US",42.161098480200003,-120.3990020752]
["CHL","Challis Airport","US",44.522998809800001,-114.2180023193]
["LMS","Louisville Winston County Airport","US",33.146198272699998,-89.0625]
["LMT","Crater Lake/Klamath Regional Airport","US",42.156101226799997,-121.73300170900001]
["LNA","Palm Beach County Park Airport","US",26.593000409999998,-80.085098270000003]
["LND","Hunt Field","US",42.815200805700002,-108.7300033569]
["LNK","Lincoln Airport","US",40.851001739499999,-96.759201049799998]
["LNN","Lake County Executive Airport","US",41.683998107900003,-81.389701843300003]
["LNP","Lonesome Pine Airport","US",36.987499237100003,-82.529998779300001]
["LNR","Tri-County Regional Airport","US",43.2117004395,-90.181602478000002]
["LNS","Lancaster Airport","US",40.121700286900001,-76.296096801800005]
["LOL","Derby Field","US",40.066398620599998,-118.5650024414]
["BBX","Wings Field","US",40.137500762899997,-75.265098571799996]
["LOT","Lewis University Airport","US",41.6072998,-88.096199040000002]
["LOU","Bowman Field","US",38.228000640899999,-85.663696289100002]
["LOZ","London Corbin Airport Magee Field","US",37.082199096700002,-84.084899902299995]
["LPC","Lompoc Airport","US",34.665599823000001,-120.4680023193]
["LQK","Pickens County Airport","US",34.810001373299997,-82.702903747600004]
["LRD","Laredo International Airport","US",27.543800353999998,-99.461601257300003]
["LRF","Little Rock Air Force Base","US",34.916900634800001,-92.149696350100001]
["LRJ","Le Mars Municipal Airport","US",42.777999880000003,-96.193702700000003]
["LRU","Las Cruces International Airport","US",32.289398193399997,-106.92199707029999]
["LSB","Lordsburg Municipal Airport","US",32.3334999084,-108.6920013428]
["LSE","La Crosse Municipal Airport","US",43.879001619999997,-91.256698610000001]
["LSF","Lawson Army Air Field (Fort Benning)","US",32.337299346899997,-84.991302490199999]
["LSK","Lusk Municipal Airport","US",42.753799438500003,-104.4049987793]
["LSN","Los Banos Municipal Airport","US",37.062900540000001,-120.8690033]
["LSV","Nellis Air Force Base","US",36.236198425300003,-115.033996582]
["LTS","Altus Air Force Base","US",34.667098998999997,-99.266700744600001]
["LUF","Luke Air Force Base","US",33.534999847400002,-112.3830032349]
["LUK","Cincinnati Municipal Airport Lunken Field","US",39.103298189999997,-84.418601989999999]
["LUL","Hesler Noble Field","US",31.672599792500002,-89.172203064000001]
["LVK","Livermore Municipal Airport","US",37.693401336699999,-121.8199996948]
["LVL","Brunswick County Airport","US",36.772800445599998,-77.794296264600007]
["LVM","Mission Field","US",45.6994018555,-110.4479980469]
["LVS","Las Vegas Municipal Airport","US",35.6542015076,-105.14199829099999]
["LWB","Greenbrier Valley Airport","US",37.858299255399999,-80.399497985799997]
["LWC","Lawrence Municipal Airport","US",39.011199949999998,-95.216598509999997]
["LWL","Wells Municipal Harriet Field","US",41.117099762000002,-114.92199707029999]
["LWM","Lawrence Municipal Airport","US",42.717201232900003,-71.123397827100007]
["LWS","Lewiston Nez Perce County Airport","US",46.374500274699997,-117.01499938960001]
["LWT","Lewistown Municipal Airport","US",47.049301147500003,-109.46700286870001]
["LWV","Lawrenceville Vincennes International Airport","US",38.7643013,-87.605499267599996]
["LXN","Jim Kelly Field","US",40.791000366200002,-99.7772979736]
["LXV","Lake County Airport","US",39.220298767099997,-106.3170013428]
["LYH","Lynchburg Regional Preston Glenn Field","US",37.326698303199997,-79.200401306200007]
["LYO","Lyons Rice County Municipal Airport","US",38.342800140000001,-98.22689819]
["LZU","Gwinnett County Briscoe Field","US",33.978099819999997,-83.962402339999997]
["MAC","Macon Downtown Airport","US",32.822101590000003,-83.561996460000003]
["MAE","Madera Municipal Airport","US",36.988601684599999,-120.11199951170001]
["MAF","Midland International Air and Space Port Airport","US",31.942499160800001,-102.202003479]
["MAW","Malden Regional Airport","US",36.6006012,-89.992202759999998]
["MBG","Mobridge Municipal Airport","US",45.546501159999998,-100.4079971]
["MBL","Manistee Co Blacker Airport","US",44.272399900000003,-86.246902469999995]
["DXE","Bruce Campbell Field","US",32.438701629599997,-90.103103637700002]
["MBS","MBS International Airport","US",43.5329017639,-84.079597473099994]
["MBY","Omar N Bradley Airport","US",39.463901519799997,-92.427001953100003]
["MCB","Mc Comb/Pike County/John E Lewis Field","US",31.178499219999999,-90.471900939999998]
["MCC","Mc Clellan Airfield","US",38.667598720000001,-121.40100099999999]
["MCD","Mackinac Island Airport","US",45.864898680000003,-84.637298580000007]
["MCE","Merced Regional Macready Field","US",37.284698489999997,-120.5139999]
["MCF","MacDill Air Force Base","US",27.849300379999999,-82.521202090000003]
["MCI","Kansas City International Airport","US",39.297599792500002,-94.713897705099996]
["MCK","Mc Cook Ben Nelson Regional Airport","US",40.206298830000001,-100.5920029]
["MCN","Middle Georgia Regional Airport","US",32.692798614499999,-83.649200439500007]
["MCO","Orlando International Airport","US",28.429399490400002,-81.308998107899995]
["MCW","Mason City Municipal Airport","US",43.157798767099997,-93.331298828100003]
["MDD","Midland Airpark","US",32.036499023399998,-102.1009979248]
["MDH","Southern Illinois Airport","US",37.778099060099997,-89.2519989014]
["XMD","Madison Municipal Airport","US",44.015998840000002,-97.085899350000005]
["MDT","Harrisburg International Airport","US",40.193500518800001,-76.763397216800001]
["MDW","Chicago Midway International Airport","US",41.785999298100002,-87.752403259299996]
["MDF","Taylor County Airport","US",45.101001740000001,-90.303298949999999]
["MXE","Laurinburg Maxton Airport","US",34.791900630000001,-79.365798949999999]
["MEI","Key Field","US",32.332599639900003,-88.751899719199997]
["MEM","Memphis International Airport","US",35.042400360099997,-89.976699829099999]
["MER","Ricardo de Tomasi International Airport","UY",-33.25,-58.067001342799998]
["MEV","Minden Tahoe Airport","US",39.000301360000002,-119.75099950000001]
["MFD","Mansfield Lahm Regional Airport","US",40.821399688699998,-82.5166015625]
["MFE","Mc Allen Miller International Airport","US",26.17580032,-98.238601680000002]
["MFI","Marshfield Municipal Airport","US",44.6369018555,-90.189300537099996]
["MFR","Rogue Valley International Medford Airport","US",42.374198913599997,-122.8730010986]
["MFV","Accomack County Airport","US",37.646900176999999,-75.761100768999995]
["MGC","Michigan City Municipal Airport","US",41.703300476099997,-86.821197509800001]
["MGE","Dobbins Air Reserve Base Airport","US",33.915401459999998,-84.516296389999994]
["MGJ","Orange County Airport","US",41.509998320000001,-74.264602659999994]
["MGM","Montgomery Regional (Dannelly Field) Airport","US",32.300598139999998,-86.393997189999993]
["MGR","Moultrie Municipal Airport","US",31.084899902299998,-83.803298950200002]
["MGW","Morgantown Municipal Walter L. Bill Hart Field","US",39.642898559999999,-79.916297909999997]
["MGY","Dayton Wright Brothers Airport","US",39.589000701899998,-84.224899292000003]
["MHE","Mitchell Municipal Airport","US",43.774799346899997,-98.038597106899999]
["MHK","Manhattan Regional Airport","US",39.1409988403,-96.670799255399999]
["MHL","Marshall Memorial Municipal Airport","US",39.0957984924,-93.202903747600004]
["MHR","Sacramento Mather Airport","US",38.553901670000002,-121.2979965]
["MHS","Dunsmuir Municipal-Mott Airport","US",41.262919439999997,-122.2720375]
["MHT","Manchester Boston Regional Airport","US",42.932598114000001,-71.435699462900004]
["MHV","Mojave Airport","US",35.059398649999999,-118.15200040000001]
["MIA","Miami International Airport","US",25.7931995392,-80.290603637700002]
["MIB","Minot Air Force Base","US",48.415599819999997,-101.3580017]
["MIC","Crystal Airport","US",45.062000274699997,-93.353897094700002]
["MIE","Delaware County Johnson Field","US",40.242298126199998,-85.395896911600005]
["MIO","Miami Municipal Airport","US",36.909198760999999,-94.887496948199995]
["MIT","Shafter Minter Field","US",35.507400509999997,-119.1920013]
["MIV","Millville Municipal Airport","US",39.367801666299997,-75.072196960400007]
["MIW","Marshalltown Municipal Airport","US",42.112701416,-92.917800903300005]
["MJQ","Jackson Municipal Airport","US",43.650001525900002,-94.986503601099997]
["MJX","Ocean County Airport","US",39.927501679999999,-74.292396550000007]
["MKC","Charles B. Wheeler Downtown Airport","US",39.123199462899997,-94.592796325699993]
["MKE","General Mitchell International Airport","US",42.947200775100001,-87.896598815900006]
["MKG","Muskegon County Airport","US",43.169498439999998,-86.238197330000006]
["MKL","Mc Kellar Sipes Regional Airport","US",35.599899290000003,-88.91560364]
["MKO","Davis Field","US",35.656501769999998,-95.366699220000001]
["MKT","Mankato Regional Airport","US",44.221599580000003,-93.918701170000006]
["MRK","Marco Island Airport","US",25.995000839199999,-81.672500610399993]
["MLB","Melbourne Orlando International Airport","US",28.102800369299999,-80.645301818799993]
["MLC","Mc Alester Regional Airport","US",34.882400509999997,-95.783500669999995]
["MLD","Malad City Airport","US",42.166599273700001,-112.29699707029999]
["MIQ","Millard Airport","US",41.195999145499997,-96.111999511700006]
["MLF","Milford Municipal-Ben and Judy Briscoe Field","US",38.426601410000004,-113.012001]
["MLI","Quad City International Airport","US",41.448501586900001,-90.507499694800003]
["MLJ","Baldwin County Airport","US",33.15420151,-83.240699770000006]
["MLS","Frank Wiley Field","US",46.428001403800003,-105.88600158689999]
["MLT","Millinocket Municipal Airport","US",45.647800445599998,-68.685600280800003]
["MLU","Monroe Regional Airport","US",32.510898590099998,-92.037696838399995]
["MMH","Mammoth Yosemite Airport","US",37.624099729999998,-118.83799740000001]
["MMI","McMinn County Airport","US",35.397300719999997,-84.562599180000007]
["MML","Southwest Minnesota Regional-Marshall-Ryan Field","US",44.450500490000003,-95.82189941]
["MMS","Selfs Airport","US",34.231498718300003,-90.289596557600007]
["MMT","Mc Entire JNGB Airport","US",33.920799260000003,-80.801300049999995]
["MMU","Morristown Municipal Airport","US",40.799400329599997,-74.414901733400001]
["MNM","Menominee Regional Airport","US",45.126701355000002,-87.638397216800001]
["MNN","Marion Municipal Airport","US",40.616199493400003,-83.063499450699993]
["MOB","Mobile Regional Airport","US",30.6912002563,-88.242797851600002]
["MOD","Modesto City Co-Harry Sham Field","US",37.625801090000003,-120.95400239999999]
["MOP","Mount Pleasant Municipal Airport","US",43.621700286900001,-84.737503051800005]
["MOR","Moore Murrell Airport","US",36.179401397699998,-83.375503539999997]
["MOT","Minot International Airport","US",48.259399414100002,-101.2799987793]
["MOX","Morris Municipal - Charlie Schmidt Airport","US",45.566001890000003,-95.967201230000001]
["RMY","Mariposa Yosemite Airport","US",37.510898590099998,-120.040000916]
["MPJ","Petit Jean Park Airport","US",35.138900756799998,-92.909202575699993]
["MPO","Pocono Mountains Municipal Airport","US",41.137500760000002,-75.378898620000001]
["MPR","Mc Pherson Airport","US",38.352401729999997,-97.691299439999995]
["MPV","Edward F Knapp State Airport","US",44.203498840000002,-72.562301640000001]
["MPZ","Mount Pleasant Municipal Airport","US",40.946601870000002,-91.511100769999999]
["MQB","Macomb Municipal Airport","US",40.520099639900003,-90.652397155800003]
["MEO","Dare County Regional Airport","US",35.918998719999998,-75.69550323]
["CTH","Chester County G O Carlson Airport","US",39.97900009,-75.865501399999999]
["MQW","Telfair Wheeler Airport","US",32.0957984924,-82.879997253400006]
["MQY","Smyrna Airport","US",36.008998870799999,-86.520103454600005]
["MRB","Eastern Wv Regional Shepherd Field","US",39.401901250000002,-77.984596249999996]
["MRC","Maury County Airport","US",35.554100036599998,-87.178901672400002]
["MRF","Marfa Municipal Airport","US",30.371099472000001,-104.0179977417]
["MRN","Foothills Regional Airport","US",35.820201873800002,-81.611396789599993]
["MRY","Monterey Peninsula Airport","US",36.587001800499998,-121.8430023193]
["MSL","Northwest Alabama Regional Airport","US",34.745300290000003,-87.610198969999999]
["MSN","Dane County Regional Truax Field","US",43.139900207499998,-89.337501525899995]
["MSO","Missoula International Airport","US",46.916301730000001,-114.09100340000001]
["MSP","Minneapolis-St Paul International/Wold-Chamberlain Airport","US",44.881999969500001,-93.221801757799994]
["MSS","Massena International Richards Field","US",44.935798644999998,-74.845596313499996]
["MSV","Sullivan County International Airport","US",41.701599119999997,-74.79499817]
["MSY","Louis Armstrong New Orleans International Airport","US",29.993400573700001,-90.258003234900002]
["MTC","Selfridge Angb Airport","US",42.608299255399999,-82.835502624499995]
["MTH","The Florida Keys Marathon Airport","US",24.72610092,-81.051399230000001]
["MTJ","Montrose Regional Airport","US",38.509799957299997,-107.893997192]
["MTN","Martin State Airport","US",39.325698850000002,-76.413803099999996]
["MTO","Coles County Memorial Airport","US",39.477901459999998,-88.279197690000004]
["MTP","Montauk Airport","US",41.076499939000001,-71.920799255399999]
["MTW","Beringin Airport","ID",-0.94032502169999999,114.8938751221]
["MUI","Muir Army Air Field (Fort Indiantown Gap) Airport","US",40.43479919,-76.56939697]
["MUL","Spence Airport","US",31.137699127200001,-83.7041015625]
["MUO","Mountain Home Air Force Base","US",43.043598175,-115.87200164790001]
["MUT","Muscatine Municipal Airport","US",41.367801666299997,-91.148200988799999]
["MVC","Monroe County Airport","US",31.458000183100001,-87.350997924799998]
["MVE","Montevideo Chippewa County Airport","US",44.9691009521,-95.710296630900004]
["MVL","Morrisville Stowe State Airport","US",44.5345993042,-72.613998413100006]
["MVN","Mount Vernon Airport","US",38.323398590099998,-88.858802795399995]
["MVY","Martha's Vineyard Airport","US",41.393100738500003,-70.6143035889]
["MWA","Veterans Airport of Southern Illinois","US",37.755001069999999,-89.011100769999999]
["MWC","Lawrence J Timmerman Airport","US",43.110401153600002,-88.034400939899996]
["MWH","Grant Co International Airport","US",47.207698819999997,-119.3199997]
["MWL","Mineral Wells Airport","US",32.7816009521,-98.060203552199994]
["MWM","Windom Municipal Airport","US",43.913398742699997,-95.109397888199993]
["MWO","Middletown Regional-Hook Field Municipal Airport","US",39.530998230000002,-84.39530182]
["MXA","Manila Municipal Airport","US",35.894401550300003,-90.154602050799994]
["MXF","Maxwell Air Force Base","US",32.382900237999998,-86.365798950200002]
["MXO","Monticello Regional Airport","US",42.220401760000001,-91.163299559999999]
["MYF","Montgomery Field","US",32.815700530999997,-117.13999938960001]
["MYL","Mc Call Municipal Airport","US",44.889701840000001,-116.1009979]
["MYR","Myrtle Beach International Airport","US",33.679698944099997,-78.928298950200002]
["MYV","Yuba County Airport","US",39.09780121,-121.5699997]
["MZJ","Pinal Airpark","US",32.510601043699999,-111.32800292970001]
["MZZ","Marion Municipal Airport","US",40.489898681600003,-85.679702758800005]
["NBG","New Orleans Nas Jrb/Alvin Callender Field/ Airport","US",29.825300219999999,-90.035003660000001]
["NHX","Barin Nolf Airport","US",30.389099121099999,-87.635299682600007]
["DGN","Dahlgren Naval Surface Warfare Center Airport","US",38.332500459999999,-77.037200929999997]
["NEL","Lakehurst NAES /Maxfield Field","US",40.03329849,-74.353301999999999]
["NEN","Whitehouse Nolf Airport","US",30.3539009094,-81.871902465800005]
["NEW","Lakefront Airport","US",30.0424003601,-90.028297424300007]
["NFL","Fallon Naval Air Station /Van Voorhis Field","US",39.416599269999999,-118.70099639999999]
["FWH","Fort Worth Nas Jrb/Carswell field","US",32.769199370000003,-97.441497799999993]
["NGP","Corpus Christi Naval Air Station/Truax Field","US",27.692600250000002,-97.291099549999998]
["NGU","Norfolk Ns (Chambers Fld) Airport","US",36.937599179999999,-76.289299009999993]
["NGW","Cabaniss Field Nolf Airport","US",27.700300216700001,-97.434402465800005]
["NHK","Patuxent River Naval Air Station/Trapnell Field Aiport","US",38.2859993,-76.411796570000007]
["NIP","Jacksonville Naval Air Station","US",30.235799790000002,-81.68060303]
["NJK","El Centro Naf Airport","US",32.829200744600001,-115.67199707029999]
["NKX","Miramar Marine Corps Air Station","US",32.868400569999999,-117.1429977]
["NLC","Lemoore Naval Air Station (Reeves Field) Airport","US",36.333000179999999,-119.9520035]
["NPA","Pensacola Naval Air Station/Forrest Sherman field","US",30.35269928,-87.318603519999996]
["NQA","Millington Regional Jetport Airport","US",35.3567008972,-89.870300293]
["NQI","Kingsville Naval Air Station","US",27.507200241100001,-97.809700012199997]
["NQX","Key West Nas /Boca Chica Field/ Airport","US",24.57579994,-81.688903809999999]
["NRB","Mayport Ns (Adm David L. Mcdonald Field) Airport","US",30.391099929999999,-81.424697879999997]
["NRS","Imperial Beach Nolf (Ream Fld) Airport","US",32.566699980000003,-117.1169968]
["NSE","Whiting Field Naval Air Station North Airport","US",30.724199299999999,-87.02189636]
["NTD","Point Mugu Naval Air Station (Naval Base Ventura Co)","US",34.120300293,-119.121002197]
["NTU","Oceana Nas /Apollo Soucek Field/ Station","US",36.8207016,-76.033500669999995]
["NUN","Saufley Field Nolf Airport","US",30.469699859599999,-87.338096618700007]
["NUQ","Moffett Federal Airfield","US",37.416099548299997,-122.0490036011]
["NUW","Whidbey Island Naval Air Station /Ault Field/ Airport","US",48.351799010000001,-122.6559982]
["NVD","Nevada Municipal Airport","US",37.852100372300001,-94.304901122999993]
["NYG","Quantico MCAF /Turner field","US",38.501701349999998,-77.305297850000002]
["YUM","Yuma MCAS/Yuma International Airport","US",32.656600949999998,-114.6060028]
["NZY","North Island Naval Air Station-Halsey Field","US",32.69919968,-117.2149963]
["NVN","Nervino Airport","US",39.818500518800001,-120.35299682599999]
["ODC","Oakdale Airport","US",37.756301880000002,-120.8000031]
["EYR","Yerington Municipal Airport","US",39.004100799600003,-119.157997131]
["OAJ","Albert J Ellis Airport","US",34.829200744600001,-77.612098693799993]
["OAK","Metropolitan Oakland International Airport","US",37.721298217799998,-122.22100067140001]
["OAR","Marina Municipal Airport","US",36.68190002,-121.762001]
["OBE","Okeechobee County Airport","US",27.262800216700001,-80.849800109900002]
["OCF","Ocala International Jim Taylor Field","US",29.17259979,-82.22419739]
["OCH","A L Mangham Jr. Regional Airport","US",31.57799911,-94.709503170000005]
["OCW","Warren Field","US",35.570499420200001,-77.049797058099998]
["OEO","L O Simenstad Municipal Airport","US",45.310001373299997,-92.691902160599994]
["OFF","Offutt Air Force Base","US",41.118301391599999,-95.912498474100005]
["OFK","Karl Stefan Memorial Airport","US",41.985500335700003,-97.435096740700004]
["OGA","Searle Field","US",41.119499210000001,-101.7699966]
["OGB","Orangeburg Municipal Airport","US",33.456798553500001,-80.859497070299994]
["OGD","Ogden Hinckley Airport","US",41.195899963400002,-112.0120010376]
["OGS","Ogdensburg International Airport","US",44.681900024400001,-75.465499877900001]
["OIC","Lt Warren Eaton Airport","US",42.566600799600003,-75.524101257300003]
["OJC","Johnson County Executive Airport","US",38.847599029999998,-94.737602229999993]
["OCN","Oceanside Municipal Airport","US",33.217300414999997,-117.35399627690001]
["OKC","Will Rogers World Airport","US",35.393100738500003,-97.600700378400006]
["ODW","Delaurentis Airport","US",48.251499176000003,-122.674003601]
["OKK","Kokomo Municipal Airport","US",40.528198242199998,-86.058998107899995]
["OKM","Okmulgee Regional Airport","US",35.668098449699997,-95.948699951199998]
["OKS","Garden County Airport","US",41.401000976600002,-102.3550033569]
["WGO","Winchester Regional Airport","US",39.143501280000002,-78.144401549999998]
["OLD","Dewitt FieldOld Town Municipal Airport","US",44.952800750000002,-68.674301150000005]
["OLE","Cattaraugus County-Olean Airport","US",42.24119949,-78.371398929999998]
["OLF","L M Clayton Airport","US",48.094501495400003,-105.5749969482]
["OLM","Olympia Regional Airport","US",46.969398499999997,-122.9029999]
["OLS","Nogales International Airport","US",31.417699813799999,-110.84799957280001]
["OLU","Columbus Municipal Airport","US",41.448001859999998,-97.342597960000006]
["OLV","Olive Branch Airport","US",34.9786987305,-89.786903381299993]
["OLY","Olney Noble Airport","US",38.721801757800002,-88.176399231000005]
["OMA","Eppley Airfield","US",41.303199768100001,-95.894096374499995]
["OMK","Omak Airport","US",48.464401245099999,-119.5179977417]
["ONA","Winona Municipal-Max Conrad Field","US",44.077201840000001,-91.708297729999998]
["ONL","The O'Neill Municipal John L Baker Field","US",42.469898219999997,-98.688102720000003]
["ONM","Socorro Municipal Airport","US",34.022499084499998,-106.9029998779]
["ONO","Ontario Municipal Airport","US",44.020500183099998,-117.013999939]
["ONP","Newport Municipal Airport","US",44.580398559599999,-124.0579986572]
["ONT","Ontario International Airport","US",34.055999755899997,-117.6009979248]
["ONY","Olney Municipal Airport","US",33.350898742699997,-98.819198608400001]
["OOA","Oskaloosa Municipal Airport","US",41.2262001,-92.493896480000004]
["OPF","Miami-Opa Locka Executive Airport","US",25.906999590000002,-80.278396610000001]
["OPL","St Landry Parish Ahart Field","US",30.5583992004,-92.099403381299993]
["NCO","Quonset State Airport","US",41.5970993042,-71.412101745599998]
["ORD","Chicago O'Hare International Airport","US",41.978599549999998,-87.904800420000001]
["ORF","Norfolk International Airport","US",36.894599914600001,-76.201202392599996]
["ORH","Worcester Regional Airport","US",42.2672996521,-71.875701904300001]
["ORL","Orlando Executive Airport","US",28.545499801599998,-81.332901000999996]
["ESD","Orcas Island Airport","US",48.708198547400002,-122.91000366199999]
["MPS","Mount Pleasant Regional Airport","US",33.095500950000002,-94.961502080000002]
["OSC","Oscoda Wurtsmith Airport","US",44.451599119999997,-83.39409637]
["OSH","Wittman Regional Airport","US",43.984401702900001,-88.556999206499995]
["OSU","Ohio State University Airport","US",40.0797996521,-83.072998046899997]
["OSX","Kosciusko Attala County Airport","US",33.090301513699998,-89.541999816900002]
["OTG","Worthington Municipal Airport","US",43.655101776099997,-95.579200744600001]
["OTH","Southwest Oregon Regional Airport","US",43.417098998999997,-124.2460021973]
["OTM","Ottumwa Regional Airport","US",41.10660172,-92.447898859999995]
["OUN","University of Oklahoma Westheimer Airport","US",35.2456016541,-97.4720993042]
["OVE","Oroville Municipal Airport","US",39.487800598100002,-121.62200164790001]
["OWA","Owatonna Degner Regional Airport","US",44.123401639999997,-93.260597230000002]
["OWB","Owensboro Daviess County Airport","US",37.740100859999998,-87.166801449999994]
["OWD","Norwood Memorial Airport","US",42.190498352100001,-71.1728973389]
["OWK","Central Maine Arpt of Norridgewock Airport","US",44.715499880000003,-69.866500849999994]
["OCE","Ocean City Municipal Airport","US",38.310398101799997,-75.124000549300007]
["OXC","Waterbury Oxford Airport","US",41.478599548299997,-73.135200500500005]
["OXD","Miami University Airport","US",39.502300259999998,-84.784400939999998]
["OXR","Oxnard Airport","US",34.200801849400001,-119.2070007324]
["STQ","St Marys Municipal Airport","US",41.412498474099998,-78.502601623499999]
["OZA","Ozona Municipal Airport","US",30.735300064099999,-101.20300292970001]
["OZR","Cairns AAF (Fort Rucker) Air Field","US",31.275699620000001,-85.713401790000006]
["BSQ","Bisbee Municipal Airport","US",31.364000320399999,-109.883003235]
["HBK","Holbrook Municipal Airport","US",34.940700530999997,-110.138000488]
["CWX","Cochise County Airport","US",32.245399480000003,-109.8949966]
["PAE","Snohomish County (Paine Field) Airport","US",47.906299590000003,-122.28199770000001]
["PAH","Barkley Regional Airport","US",37.060798644999998,-88.773803710899998]
["PAM","Tyndall Air Force Base","US",30.069599151599999,-85.575401306200007]
["PJB","Payson Airport","US",34.256801605200003,-111.3389968872]
["PAO","Palo Alto Airport of Santa Clara County","US",37.461101532000001,-122.1149978638]
["PBF","Grider Field","US",34.173099517799997,-91.935600280800003]
["PBG","Plattsburgh International Airport","US",44.650901794399999,-73.468101501500001]
["PBI","Palm Beach International Airport","US",26.683200836200001,-80.095596313499996]
["PVL","Pike County-Hatcher Field","US",37.561798099999997,-82.566398620000001]
["PCD","Prairie Du Chien Municipal Airport","US",43.019298553500001,-91.123703002900001]
["PDK","DeKalb Peachtree Airport","US",33.875598907499999,-84.302001953100003]
["PDT","Eastern Oregon Regional At Pendleton Airport","US",45.695098877,-118.841003418]
["PDX","Portland International Airport","US",45.588699339999998,-122.59799959999999]
["PEQ","Pecos Municipal Airport","US",31.382400512699999,-103.51100158689999]
["PFC","Pacific City State Airport","US",45.199798584,-123.961997986]
["PFN","Panama City-Bay Co International Airport","US",30.212099075299999,-85.682800293]
["PGA","Page Municipal Airport","US",36.926101680000002,-111.447998]
["PGD","Punta Gorda Airport","US",26.920200350000002,-81.990501399999999]
["PGR","Kirk Field","US",36.062900540000001,-90.507797240000002]
["PGV","Pitt Greenville Airport","US",35.635200500000003,-77.385299680000003]
["PHD","Harry Clever Field","US",40.470901489299997,-81.419700622600004]
["PHF","Newport News Williamsburg International Airport","US",37.131900790000003,-76.492996219999995]
["ADR","Robert F Swinnie Airport","US",33.451698303199997,-79.526199340800005]
["PHK","Palm Beach Co Glades Airport","US",26.784999849999998,-80.693397520000005]
["PHL","Philadelphia International Airport","US",39.871898651099997,-75.241096496599994]
["PHN","St Clair County International Airport","US",42.9109993,-82.528900149999998]
["PHP","Philip Airport","US",44.048599243200002,-101.5989990234]
["PHT","Henry County Airport","US",36.338199615500002,-88.382896423299997]
["PHX","Phoenix Sky Harbor International Airport","US",33.434299469000003,-112.0120010376]
["PIA","Greater Peoria Regional Airport","US",40.664199829099999,-89.693298339799995]
["PIB","Hattiesburg Laurel Regional Airport","US",31.4671001434,-89.337097168]
["PIE","St Petersburg Clearwater International Airport","US",27.910200119999999,-82.687400819999993]
["PIH","Pocatello Regional Airport","US",42.909801483199999,-112.59600067140001]
["PIM","Harris County Airport","US",32.840698242199998,-84.882400512700002]
["PIR","Pierre Regional Airport","US",44.382701869999998,-100.2860031]
["PIT","Pittsburgh International Airport","US",40.491500850000001,-80.232902530000004]
["PKB","Mid Ohio Valley Regional Airport","US",39.3451004028,-81.439201354999994]
["PKD","Park Rapids Municipal Konshok Field","US",46.900600429999997,-95.073097230000002]
["PKF","Park Falls Municipal Airport","US",45.955001831099999,-90.424400329600005]
["PLK","M. Graham Clark-Taney County Airport","US",36.625900270000002,-93.228897090000004]
["PLN","Pellston Regional Airport of Emmet County Airport","US",45.570899959999998,-84.796699520000004]
["PLR","St Clair County Airport","US",33.5587997437,-86.249099731399994]
["PMB","Pembina Municipal Airport","US",48.9425010681,-97.240798950200002]
["PMD","Palmdale Regional/USAF Plant 42 Airport","US",34.629398350000002,-118.0849991]
["PMH","Greater Portsmouth Regional Airport","US",38.840499877900001,-82.847297668500005]
["PPM","Pompano Beach Airpark","US",26.247100830099999,-80.111099243200002]
["PWY","Ralph Wenz Field","US",42.795501710000003,-109.80699920000001]
["PNC","Ponca City Regional Airport","US",36.731998439999998,-97.099800110000004]
["PNE","Northeast Philadelphia Airport","US",40.081901549999998,-75.010597230000002]
["PNN","Princeton Municipal Airport","US",45.200698852499997,-67.564399719199997]
["PNS","Pensacola Regional Airport","US",30.473400116000001,-87.186599731399994]
["POB","Pope Air Force Base","US",35.1708984375,-79.014503478999998]
["POC","Brackett Field","US",34.091598510700003,-117.7819976807]
["POE","Polk Army Air Field","US",31.0447998,-93.191703799999999]
["POF","Poplar Bluff Regional Business Airport","US",36.773899078399999,-90.324897766099994]
["POH","Pocahontas Municipal Airport","US",42.742801669999999,-94.647300720000004]
["POU","Hudson Valley Regional Airport","US",41.626598358199999,-73.884201049799998]
["POY","Powell Municipal Airport","US",44.867198944099997,-108.7929992676]
["PPA","Perry Lefors Field","US",35.612998962399999,-100.9960021973]
["PPF","Tri City Airport","US",37.329898829999998,-95.506202700000003]
["LPO","La Porte Municipal Airport","US",41.572498321499999,-86.734497070299994]
["PQI","Presque Isle International Airport","US",46.688999180000003,-68.044799800000007]
["PGL","Trent Lott International Airport","US",30.462799072300001,-88.529197692899999]
["PRB","Paso Robles Municipal Airport","US",35.672901150000001,-120.6269989]
["PRC","Ernest A. Love Field","US",34.654499049999998,-112.41999819999999]
["PRO","Perry Municipal Airport","US",41.82799911,-94.159896849999996]
["PRX","Cox Field","US",33.6366004944,-95.4507980347]
["PSB","Mid State Airport","US",40.884399414100002,-78.087303161600005]
["PSC","Tri Cities Airport","US",46.264701843300003,-119.1190032959]
["PSF","Pittsfield Municipal Airport","US",42.426799774199999,-73.292900085400007]
["PSK","New River Valley Airport","US",37.137298584,-80.678497314500007]
["PSM","Portsmouth International at Pease Airport","US",43.077899932900003,-70.823303222700005]
["PSN","Palestine Municipal Airport","US",31.779699325599999,-95.706298828100003]
["PGO","Stevens Field","US",37.286300660000002,-107.0559998]
["PSP","Palm Springs International Airport","US",33.829700469999999,-116.50700378419999]
["PSX","Palacios Municipal Airport","US",28.727500915499999,-96.250999450699993]
["PTB","Dinwiddie County Airport","US",37.1837997437,-77.507400512700002]
["PTK","Oakland County International Airport","US",42.665500640899999,-83.420097351099997]
["PTN","Harry P Williams Memorial Airport","US",29.709499359100001,-91.338996887199997]
["PTS","Atkinson Municipal Airport","US",37.449501037600001,-94.731101989699994]
["PTT","Pratt Industrial Airport","US",37.701599119999997,-98.746902469999995]
["PTV","Porterville Municipal Airport","US",36.0295982361,-119.06300354]
["PTW","Heritage Field","US",40.239601135299999,-75.556701660200005]
["PUB","Pueblo Memorial Airport","US",38.289100646999998,-104.49700164790001]
["PUC","Carbon County Regional/Buck Davis Field","US",39.613899230000001,-110.75099950000001]
["PUW","Pullman Moscow Regional Airport","US",46.743900299099998,-117.11000061039999]
["PVC","Provincetown Municipal Airport","US",42.071899414100002,-70.221397399899999]
["PVD","Rhode Island TF Green International Airport","US",41.732601165799998,-71.420402526900006]
["PVF","Placerville Airport","US",38.724201202400003,-120.75299835209999]
["PVU","Provo Municipal Airport","US",40.219200134300003,-111.72299957280001]
["PVW","Hale County Airport","US",34.168098449699997,-101.71700286870001]
["PWA","Wiley Post Airport","US",35.534198760000002,-97.647102360000005]
["PWD","Sher Wood Airport","US",48.790298461900001,-104.533996582]
["PWM","Portland International Jetport Airport","US",43.646198269999999,-70.309303279999995]
["PWT","Bremerton National Airport","US",47.490200042700003,-122.76499938960001]
["PYM","Plymouth Municipal Airport","US",41.909000396700002,-70.728797912600001]
["RAC","John H Batten Airport","US",42.760601043699999,-87.815200805700002]
["RAL","Riverside Municipal Airport","US",33.951900479999999,-117.4449997]
["RAP","Rapid City Regional Airport","US",44.045299530000001,-103.0569992065]
["RBD","Dallas Executive Airport","US",32.680900573700001,-96.868202209499998]
["RBG","Roseburg Regional Airport","US",43.238800048800002,-123.35600280760001]
["RBL","Red Bluff Municipal Airport","US",40.150699615500002,-122.2519989014]
["RBW","Lowcountry Regional Airport","US",32.921001434300003,-80.640602111800007]
["RCA","Ellsworth Air Force Base","US",44.145000459999999,-103.10399630000001]
["RCK","H H Coffield Regional Airport","US",30.631599426299999,-96.989700317399993]
["RCR","Fulton County Airport","US",41.065601348900003,-86.181701660200005]
["RCT","Nartron Field","US",43.900001525900002,-85.516700744600001]
["RDD","Redding Municipal Airport","US",40.508998869999999,-122.29299930000001]
["RDG","Reading Regional Carl A Spaatz Field","US",40.378501892099997,-75.965202331499995]
["RDM","Roberts Field","US",44.254100800000003,-121.1500015]
["RDR","Grand Forks Air Force Base","US",47.961101532000001,-97.401199340800005]
["RDU","Raleigh Durham International Airport","US",35.877601623499999,-78.787498474100005]
["REO","Rome State Airport","US",42.577701568599998,-117.8850021362]
["RFD","Chicago Rockford International Airport","US",42.195400237999998,-89.097198486300002]
["RFG","Rooke Field","US",28.293600082400001,-97.322998046899997]
["RHI","Rhinelander Oneida County Airport","US",45.631198883099998,-89.467498779300001]
["RHV","Reid Hillview of Santa Clara County Airport","US",37.332901001000003,-121.8190002441]
["RIC","Richmond International Airport","US",37.505199432399998,-77.319702148399998]
["RID","Richmond Municipal Airport","US",39.757198333700003,-84.842796325699993]
["RIF","Richfield Municipal Airport","US",38.7364006042,-112.0989990234]
["RIL","Garfield County Regional Airport","US",39.526298519999997,-107.7269974]
["RIR","Flabob Airport","US",33.989700317400001,-117.4110031128]
["RIV","March ARB Airport","US",33.880699159999999,-117.2590027]
["RIW","Central Wyoming Regional Airport","US",43.064201355000002,-108.4599990845]
["RKD","Knox County Regional Airport","US",44.060100560000002,-69.09919739]
["RKP","Aransas County Airport","US",28.086799621600001,-97.044601440400001]
["RKR","Robert S Kerr Airport","US",35.021598815899999,-94.621299743700007]
["RKS","Southwest Wyoming Regional Airport","US",41.594200129999997,-109.0650024]
["RKW","Rockwood Municipal Airport","US",35.922298431400002,-84.689697265600003]
["RLD","Richland Airport","US",46.305599212600001,-119.3040008545]
["RME","Griffiss International Airport","US",43.233798980000003,-75.406997680000003]
["RMG","Richard B Russell Airport","US",34.350601196299998,-85.157997131299993]
["RNC","Warren County Memorial Airport","US",35.698699949999998,-85.843803410000007]
["RND","Randolph Air Force Base","US",29.52969933,-98.278900149999998]
["RNH","New Richmond Regional Airport","US",45.148300169999999,-92.5381012]
["RNO","Reno Tahoe International Airport","US",39.499099731400001,-119.7679977417]
["RNT","Renton Municipal Airport","US",47.493099212600001,-122.216003418]
["ROA","Roanoke Regional Woodrum Field","US",37.325500488300001,-79.975402832]
["ROC","Greater Rochester International Airport","US",43.118900299099998,-77.672401428200004]
["ROG","Rogers Executive Airport","US",36.37229919,-94.106903079999995]
["ROW","Roswell International Air Center Airport","US",33.301601409900002,-104.53099822999999]
["ROX","Roseau Municipal Rudy Billberg Field","US",48.855998990000003,-95.696998600000001]
["RIE","Rice Lake Regional Carl's Field","US",45.418998719999998,-91.773498540000006]
["RPX","Roundup Airport","US",46.474998474099998,-108.5429992676]
["WBR","Roben Hood Airport","US",43.722599029500003,-85.504096984900002]
["RQO","El Reno Regional Airport","US",35.472698209999997,-98.005798339999998]
["RRL","Merrill Municipal Airport","US",45.198898315400001,-89.712898254400002]
["RRT","Warroad International Memorial Field","US",48.941398620000001,-95.348396300000005]
["RSL","Russell Municipal Airport","US",38.872100830100003,-98.811798095699999]
["RSN","Ruston Regional Airport","US",32.514400482200003,-92.591697692899999]
["RST","Rochester International Airport","US",43.9082984924,-92.5]
["RSW","Southwest Florida International Airport","US",26.536199569699999,-81.755203247099999]
["RTN","Raton Municipal-Crews Field","US",36.741500850000001,-104.5019989]
["SRW","Mid-Carolina Regional Airport","US",35.645900730000001,-80.52030182]
["RUT","Rutland - Southern Vermont Regional Airport","US",43.529399869999999,-72.949600219999994]
["RED","Mifflin County Airport","US",40.677398681600003,-77.626800537099996]
["RVS","Tulsa Riverside Airport","US",36.039600372300001,-95.984596252399996]
["RWF","Redwood Falls Municipal Airport","US",44.547199249999998,-95.082298280000003]
["RWI","Rocky Mount Wilson Regional Airport","US",35.856300353999998,-77.891899108900006]
["RWL","Rawlins Municipal Harvey Field","US",41.805599209999997,-107.1999969]
["RXE","Rexburg Madison County Airport","US",43.833900451700003,-111.80500030499999]
["RNZ","Jasper County Airport","US",40.947898864700001,-87.182601928699995]
["RZZ","Halifax County Airport","US",36.4394989014,-77.709297180199997]
["AHM","Ashland Municipal Sumner Parker Field","US",42.190299987800003,-122.66100311300001]
["BDY","Bandon State Airport","US",43.086498259999999,-124.4079971]
["SUO","Sunriver Airport","US",43.8763008118,-121.45300293]
["VSK","Vista Field","US",46.218601226799997,-119.209999084]
["SAA","Shively Field","US",41.444900512700002,-106.8239974976]
["SAC","Sacramento Executive Airport","US",38.512500762899997,-121.49299621580001]
["SAD","Safford Regional Airport","US",32.854801180000003,-109.63500209999999]
["SAF","Santa Fe Municipal Airport","US",35.617099762000002,-106.08899688699999]
["SAN","San Diego International Airport","US",32.733600616499999,-117.1900024414]
["SAR","Sparta Community Hunter Field","US",38.148899078399999,-89.698699951199998]
["SAS","Salton Sea Airport","US",33.241401672400002,-115.952003479]
["SAT","San Antonio International Airport","US",29.533700942999999,-98.469802856399994]
["SAV","Savannah Hilton Head International Airport","US",32.12760162,-81.202102659999994]
["MQT","Sawyer International Airport","US",46.353599548299997,-87.395401000999996]
["SBA","Santa Barbara Municipal Airport","US",34.426200870000002,-119.8399963]
["SBD","San Bernardino International Airport","US",34.0954017639,-117.23500061039999]
["SBM","Sheboygan County Memorial Airport","US",43.769599909999997,-87.851402280000002]
["SBN","South Bend Regional Airport","US",41.708698272699998,-86.317298889200003]
["SBP","San Luis County Regional Airport","US",35.236801147500003,-120.64199829099999]
["SBS","Steamboat Springs Bob Adams Field","US",40.516300200000003,-106.8659973]
["SBX","Shelby Airport","US",48.540699005100002,-111.8710021973]
["SBY","Salisbury Ocean City Wicomico Regional Airport","US",38.340499877900001,-75.510299682600007]
["SCB","Scribner State Airport","US",41.610298156699997,-96.629898071300005]
["SCH","Schenectady County Airport","US",42.852500915500002,-73.928901672400002]
["SCK","Stockton Metropolitan Airport","US",37.894199371299997,-121.2379989624]
["SDF","Louisville Muhammad Ali International Airport","US",38.174400329599997,-85.736000060999999]
["SCF","Scottsdale Airport","US",33.622898101799997,-111.9110031128]
["SDM","Brown Field Municipal Airport","US",32.572299957299997,-116.9800033569]
["SDY","Sidney Richland Municipal Airport","US",47.706901549999998,-104.19300079999999]
["SEA","Seattle Tacoma International Airport","US",47.449001312299998,-122.3089981079]
["SEE","Gillespie Field","US",32.826198577900001,-116.9720001221]
["SEF","Sebring Regional Airport","US",27.456399919999999,-81.342399599999993]
["SEG","Penn Valley Airport","US",40.820598602300002,-76.863899231000005]
["SEM","Craig Field","US",32.343898773200003,-86.987800598099994]
["SEP","Stephenville Clark Regional Airport","US",32.215301513699998,-98.177696228000002]
["SER","Freeman Municipal Airport","US",38.923599243200002,-85.907402038599997]
["SDX","Sedona Airport","US",34.848598480200003,-111.7880020142]
["SFB","Orlando Sanford International Airport","US",28.7775993347,-81.237503051800005]
["SFF","Felts Field","US",47.682800293,-117.3229980469]
["SFM","Sanford Regional Airport","US",43.393901825,-70.708000183099998]
["SFO","San Francisco International Airport","US",37.618999481199999,-122.375]
["SFZ","North Central State Airport","US",41.920799255399999,-71.491401672400002]
["SGF","Springfield Branson National Airport","US",37.245700839999998,-93.388603209999999]
["SGH","Springfield Beckley Municipal Airport","US",39.840301513699998,-83.840202331499995]
["UST","Northeast Florida Regional Airport","US",29.959199905399998,-81.3397979736]
["SGR","Sugar Land Regional Airport","US",29.622299194299998,-95.656501770000006]
["SGT","Stuttgart Municipal Airport","US",34.599498748800002,-91.574996948199995]
["SGU","St George Municipal Airport","US",37.036388888899999,-113.51030555600001]
["SHD","Shenandoah Valley Regional Airport","US",38.263801574699997,-78.896400451700003]
["SHN","Sanderson Field","US",47.233600616499999,-123.14800262449999]
["SHR","Sheridan County Airport","US",44.769199371299997,-106.9800033569]
["SHV","Shreveport Regional Airport","US",32.446601867699997,-93.825599670399995]
["SIK","Sikeston Memorial Municipal Airport","US",36.898899078399999,-89.561798095699999]
["SIV","Sullivan County Airport","US",39.114700317400001,-87.448303222700005]
["SIY","Siskiyou County Airport","US",41.781398773200003,-122.4680023193]
["SJC","Norman Y. Mineta San Jose International Airport","US",37.362598419199998,-121.9290008545]
["SJN","St Johns Industrial Air Park","US",34.518600460000002,-109.37899779999999]
["SJT","San Angelo Regional Mathis Field","US",31.3577003479,-100.4960021973]
["SKA","Fairchild Air Force Base","US",47.615100860600002,-117.65599822999999]
["SKF","Lackland Air Force Base (Kelly Field Annex) Airport","US",29.38419914,-98.581100460000002]
["TSM","Taos Regional Airport","US",36.458198549999999,-105.6719971]
["SLB","Storm Lake Municipal Airport","US",42.597301483199999,-95.240699768100001]
["SLC","Salt Lake City International Airport","US",40.788398742699997,-111.9779968262]
["SLE","McNary Field","US",44.909500119999997,-123.0029984]
["SLG","Smith Field","US",36.191898350000002,-94.489997860000003]
["SLK","Adirondack Regional Airport","US",44.385299682599999,-74.206199646000002]
["SLN","Salina Municipal Airport","US",38.791000366200002,-97.652198791499998]
["SLO","Salem Leckrone Airport","US",38.642898559599999,-88.964202880900004]
["SLR","Sulphur Springs Municipal Airport","US",33.159801483199999,-95.621101379400002]
["SMD","Smith Field","US",41.14339828,-85.152801510000003]
["SME","Lake Cumberland Regional Airport","US",37.053398132300003,-84.615898132300003]
["SMF","Sacramento International Airport","US",38.695400237999998,-121.591003418]
["SMN","Lemhi County Airport","US",45.123798370400003,-113.8809967041]
["SMO","Santa Monica Municipal Airport","US",34.015800476099997,-118.4509963989]
["SUM","Sumter Airport","US",33.9949989319,-80.361297607400004]
["SMX","Santa Maria Pub/Capt G Allan Hancock Field","US",34.89889908,-120.45700069999999]
["SNA","John Wayne Airport-Orange County Airport","US",33.675701140000001,-117.86799619999999]
["SNK","Winston Field","US",32.693401336699999,-100.9499969482]
["SNL","Shawnee Regional Airport","US",35.357898712199997,-96.9428024292]
["SNS","Salinas Municipal Airport","US",36.662799835199998,-121.60600280760001]
["SNY","Sidney Municipal-Lloyd W Carr Field","US",41.10129929,-102.98500060000001]
["SOP","Moore County Airport","US",35.237400049999998,-79.391197199999993]
["SOW","Show Low Regional Airport","US",34.265499114999997,-110.005996704]
["SPA","Spartanburg Downtown Memorial Airport","US",34.915699005100002,-81.956497192399993]
["SPF","Black Hills Clyde Ice Field","US",44.480300903299998,-103.78299713129999]
["SPG","Albert Whitted Airport","US",27.765100479099999,-82.6269989014]
["SPI","Abraham Lincoln Capital Airport","US",39.844100949999998,-89.677902219999993]
["SPS","Sheppard Air Force Base-Wichita Falls Municipal Airport","US",33.988800050000002,-98.49189758]
["SPW","Spencer Municipal Airport","US",43.165500640899999,-95.202796935999999]
["SQI","Whiteside Co Arpt-Jos H Bittorf field","US",41.742801669999999,-89.676300049999995]
["SQL","Sleetmute Airport","US",61.700500488300001,-157.16600036599999]
["SRC","Searcy Municipal Airport","US",35.21060181,-91.737503050000001]
["SRQ","Sarasota Bradenton International Airport","US",27.395399093599998,-82.554397582999997]
["RUI","Sierra Blanca Regional Airport","US",33.462799072300001,-105.5350036621]
["SSC","Shaw Air Force Base","US",33.972698209999997,-80.470596310000005]
["SSF","Stinson Municipal Airport","US",29.336999893200002,-98.471099853499993]
["SSI","St. Simons Island Airport at McKinnon Field","US",31.151800160000001,-81.391296389999994]
["STC","St Cloud Regional Airport","US",45.546600341800001,-94.059898376500001]
["STE","Stevens Point Municipal Airport","US",44.5452003479,-89.530296325699993]
["STJ","Rosecrans Memorial Airport","US",39.771900176999999,-94.909698486300002]
["STK","Sterling Municipal Airport","US",40.615299219999997,-103.26499939999999]
["STL","Lambert St Louis International Airport","US",38.7486991882,-90.370002746599994]
["STP","St Paul Downtown Holman Field","US",44.934501647899999,-93.059997558600003]
["STS","Charles M. Schulz Sonoma County Airport","US",38.508998869999999,-122.81300349999999]
["SUA","Witham Field","US",27.18169975,-80.221099850000002]
["SUD","Stroud Municipal Airport","US",35.789600372300001,-96.655700683600003]
["SUE","Door County Cherryland Airport","US",44.843700409999997,-87.421501160000005]
["SUN","Friedman Memorial Airport","US",43.504398350000002,-114.29599760000001]
["SUS","Spirit of St Louis Airport","US",38.662101745599998,-90.652000427199994]
["SUU","Travis Air Force Base","US",38.262699127200001,-121.9270019531]
["SUW","Richard I Bong Airport","US",46.689701080299997,-92.094703674300007]
["SUX","Sioux Gateway Col. Bud Day Field","US",42.402599330000001,-96.38439941]
["SVC","Grant County Airport","US",32.636501312299998,-108.15599822999999]
["SVE","Susanville Municipal Airport","US",40.375701904300001,-120.5729980469]
["SVH","Statesville Regional Airport","US",35.7653007507,-80.953903198199995]
["SVN","Hunter Army Air Field","US",32.009998320000001,-81.145698550000006]
["SWF","Stewart International Airport","US",41.504100799600003,-74.104797363299994]
["SWO","Stillwater Regional Airport","US",36.161201477100001,-97.085700988799999]
["SWW","Avenger Field","US",32.4673995972,-100.46700286870001]
["SYI","Bomar Field Shelbyville Municipal Airport","US",35.560100560000002,-86.442497250000002]
["SYN","Stanton Airfield","US",44.475498199500002,-93.016296386700006]
["SYR","Syracuse Hancock International Airport","US",43.111198425300003,-76.106300353999998]
["SYV","Sylvester Airport","US",31.5585002899,-83.895698547400002]
["SZL","Whiteman Air Force Base","US",38.730300903299998,-93.5478973389]
["SZN","Santa Cruz Island Airport","US",34.060600280800003,-119.915000916]
["SZP","Santa Paula Airport","US",34.347198489999997,-119.060997]
["TAD","Perry Stokes Airport","US",37.259399414100002,-104.341003418]
["TBN","Waynesville-St. Robert Regional Forney field","US",37.741600040000002,-92.140701289999996]
["TBR","Statesboro Bulloch County Airport","US",32.4827003479,-81.736900329600005]
["TCC","Tucumcari Municipal Airport","US",35.182800293,-103.6029968262]
["TCL","Tuscaloosa Regional Airport","US",33.220600128199997,-87.611396789599993]
["TCM","McChord Air Force Base","US",47.137699127200001,-122.4759979248]
["TCS","Truth Or Consequences Municipal Airport","US",33.236900329599997,-107.2720031738]
["TDO","Ed Carlson Memorial Field South Lewis County Airport","US",46.477199554400002,-122.8059997559]
["TDW","Tradewind Airport","US",35.1698989868,-101.8259963989]
["TDZ","Toledo Executive Airport","US",41.564899439999998,-83.482299800000007]
["TEB","Teterboro Airport","US",40.8501014709,-74.060798645000006]
["TEX","Telluride Regional Airport","US",37.953800200000003,-107.9079971]
["THA","Tullahoma Regional Arpt/Wm Northern Field","US",35.380100249999998,-86.246398929999998]
["THM","Thompson Falls Airport","US",47.573501586900001,-115.28099822999999]
["THV","York Airport","US",39.916999820000001,-76.873001099999996]
["TIK","Tinker Air Force Base","US",35.414699554400002,-97.386596679700006]
["TIW","Tacoma Narrows Airport","US",47.267898559999999,-122.5780029]
["TIX","Space Coast Regional Airport","US",28.514799117999999,-80.7992019653]
["KNT","Kennett Memorial Airport","US",36.225898742699997,-90.036598205600001]
["TLH","Tallahassee Regional Airport","US",30.396499633800001,-84.350303649899999]
["TLR","Mefford Field","US",36.156299590000003,-119.32599639999999]
["TMA","Henry Tift Myers Airport","US",31.4290008545,-83.488502502399996]
["TMB","Miami Executive Airport","US",25.647563699999999,-80.433224600000003]
["OTK","Tillamook Airport","US",45.418201446499999,-123.814002991]
["ASQ","Austin Airport","US",39.467998504599997,-117.19499969500001]
["TNP","Twentynine Palms Airport","US",34.131599430000001,-115.94599909999999]
["TNT","Dade Collier Training and Transition Airport","US",25.861799240100002,-80.897003173800002]
["TNU","Newton Municipal Airport","US",41.674400329599997,-93.021697997999993]
["XSD","Tonopah Test Range Airport","US",37.798801422099999,-116.78099822999999]
["TOA","Zamperini Field","US",33.803398132300003,-118.3399963379]
["TOC","Toccoa Rg Letourneau Field","US",34.593799590000003,-83.295799259999995]
["TOI","Troy Municipal Airport","US",31.8603992462,-86.012100219700002]
["TOL","Toledo Express Airport","US",41.586799620000001,-83.807800290000003]
["TOP","Philip Billard Municipal Airport","US",39.068698883099998,-95.622497558600003]
["TOR","Torrington Municipal Airport","US",42.064498899999997,-104.1529999]
["TPA","Tampa International Airport","US",27.975500106799998,-82.533203125]
["TPF","Peter O Knight Airport","US",27.915599823000001,-82.449302673299997]
["TPH","Tonopah Airport","US",38.060199740000002,-117.08699799999999]
["TPL","Draughon Miller Central Texas Regional Airport","US",31.152500152599998,-97.407798767100005]
["TRI","Tri Cities Regional Tn Va Airport","US",36.475200653100003,-82.407402038599997]
["TKF","Truckee Tahoe Airport","US",39.319999694800003,-120.13999938960001]
["TRL","Terrell Municipal Airport","US",32.709201812700002,-96.267402648900003]
["TRM","Jacqueline Cochran Regional Airport","US",33.626701355000002,-116.1600036621]
["TRX","Trenton Municipal Airport","US",40.08349991,-93.590599060000002]
["TSP","Tehachapi Municipal Airport","US",35.134998321499999,-118.4390029907]
["TTD","Portland Troutdale Airport","US",45.549400329599997,-122.4010009766]
["TTN","Trenton Mercer Airport","US",40.276699066200003,-74.813499450699993]
["TUL","Tulsa International Airport","US",36.198398590099998,-95.888099670399995]
["TUP","Tupelo Regional Airport","US",34.268100738500003,-88.769897460899998]
["TUS","Tucson International Airport","US",32.116100311300002,-110.9410018921]
["TVC","Cherry Capital Airport","US",44.741401672400002,-85.582199096699995]
["TVF","Thief River Falls Regional Airport","US",48.065700530000001,-96.184997559999999]
["TVI","Thomasville Regional Airport","US",30.901599883999999,-83.881301879899993]
["TVL","Lake Tahoe Airport","US",38.893901825,-119.99500274659999]
["TWF","Joslin Field Magic Valley Regional Airport","US",42.481800079999999,-114.487999]
["TXK","Texarkana Regional Webb Field","US",33.453701019299999,-93.990997314500007]
["TYZ","Taylor Airport","US",34.452800750000002,-110.11499790000001]
["TYR","Tyler Pounds Regional Airport","US",32.354099273700001,-95.402397155800003]
["TYS","McGhee Tyson Airport","US",35.811000819999997,-83.994003300000003]
["BFG","Bullfrog Basin Airport","US",37.545799260000003,-110.71299740000001]
["RVR","Green River Municipal Airport","US",38.961399078399999,-110.226997375]
["ICS","Cascade Airport","US",44.493801116900002,-116.01599883999999]
["UBS","Columbus Lowndes County Airport","US",33.4654006958,-88.3803024292]
["UCY","Everett-Stewart Regional Airport","US",36.381801609999997,-88.985397340000006]
["UDD","Bermuda Dunes Airport","US",33.748401641800001,-116.2750015259]
["UES","Waukesha County Airport","US",43.041000366200002,-88.237098693799993]
["UGN","Waukegan Regional Airport","US",42.4221992493,-87.867897033700004]
["UIL","Quillayute Airport","US",47.936599731400001,-124.56300354]
["UIN","Quincy Regional Baldwin Field","US",39.942699429999998,-91.194602970000005]
["IKB","Wilkes County Airport","US",36.222801208500002,-81.098297119099996]
["UKI","Ukiah Municipal Airport","US",39.1259994507,-123.2009963989]
["UKT","Quakertown Airport","US",40.4351997375,-75.381896972700005]
["ULM","New Ulm Municipal Airport","US",44.319599151600002,-94.502296447800006]
["ATO","Ohio University Snyder Field","US",39.210998535199998,-82.2313995361]
["UNU","Dodge County Airport","US",43.426601410000004,-88.703201289999996]
["SCE","State College Regional Airport","US",40.849300384499998,-77.848701477099993]
["UOS","Franklin County Airport","US",35.2051010132,-85.898101806599996]
["UOX","University Oxford Airport","US",34.384300231899999,-89.536796569800003]
["UTM","Tunica Municipal Airport","US",34.680999755899997,-90.346702575699993]
["HTV","Huntsville Municipal Airport","US",30.746900558499998,-95.587196350100001]
["NPT","Newport State Airport","US",41.532398223900003,-71.281501770000006]
["UVA","Garner Field","US",29.2112998962,-99.743598938000005]
["RKH","Rock Hill York Co Bryant field","US",34.9878006,-81.05719757]
["VAD","Moody Air Force Base","US",30.967800140400001,-83.193000793500005]
["LLY","South Jersey Regional Airport","US",39.942901611300002,-74.845703125]
["VBG","Vandenberg Air Force Base","US",34.737300872799999,-120.5839996338]
["VCT","Victoria Regional Airport","US",28.852600097700002,-96.918502807600007]
["VCV","Southern California Logistics Airport","US",34.597499847400002,-117.3830032349]
["VDI","Vidalia Regional Airport","US",32.192699432399998,-82.371200561500004]
["VEL","Vernal Regional Airport","US",40.440898900000001,-109.51000209999999]
["VGT","North Las Vegas Airport","US",36.210700988799999,-115.1940002441]
["VHN","Culberson County Airport","US",31.057800293,-104.783996582]
["VIH","Rolla National Airport","US",38.127399444600002,-91.769500732400004]
["VIS","Visalia Municipal Airport","US",36.318698883099998,-119.3929977417]
["VJI","Virginia Highlands Airport","US",36.687099456799999,-82.033302307100001]
["VKS","Vicksburg Municipal Airport","US",32.239299774199999,-90.928398132300003]
["VKX","Potomac Airfield","US",38.747600560000002,-76.957199099999997]
["VLA","Vandalia Municipal Airport","US",38.991500854500003,-89.1661987305]
["VLD","Valdosta Regional Airport","US",30.782499313399999,-83.276702880900004]
["VNC","Venice Municipal Airport","US",27.071599960299999,-82.440299987800003]
["VNY","Van Nuys Airport","US",34.209800720200001,-118.4899978638]
["VOK","Volk Field","US",43.938999176000003,-90.253402710000003]
["VPS","Eglin Air Force Base","US",30.483200073199999,-86.525398254400002]
["VPZ","Porter County Municipal Airport","US",41.453998570000003,-87.007102970000005]
["VQQ","Cecil Field","US",30.218700408899998,-81.876701354999994]
["VRB","Vero Beach Municipal Airport","US",27.6555995941,-80.417900085400007]
["VSF","Hartness State (Springfield) Airport","US",43.343601229999997,-72.517303470000002]
["VTN","Miller Field","US",42.857799530000001,-100.5479965]
["VYS","Illinois Valley Regional-Walter A Duncan field","US",41.35189819,-89.153099060000002]
["PGC","Grant County Airport","US",38.994944439999998,-79.145861109999998]
["WAL","Wallops Flight Facility Airport","US",37.940200805700002,-75.466400146500007]
["WAY","Greene County Airport","US",39.900100709999997,-80.13310242]
["WBW","Wilkes Barre Wyoming Valley Airport","US",41.2971992493,-75.851196289100002]
["WDG","Enid Woodring Regional Airport","US",36.379199981699998,-97.791099548299997]
["WDR","Barrow County Airport","US",33.982898710000001,-83.667396550000007]
["WHP","Whiteman Airport","US",34.259300231899999,-118.4130020142]
["WJF","General WM J Fox Airfield","US",34.74110031,-118.2190018]
["WLD","Strother Field","US",37.168598175,-97.037597656299994]
["WLW","Willows Glenn County Airport","US",39.516399380000003,-122.21800229999999]
["WMC","Winnemucca Municipal Airport","US",40.896598815899999,-117.8059997559]
["WRB","Robins Air Force Base","US",32.640098571800003,-83.591903686500004]
["WRI","Mc Guire Air Force Base","US",40.015598300000001,-74.591697690000004]
["WRL","Worland Municipal Airport","US",43.965698242199998,-107.9509963989]
["WSD","Condron Army Air Field","US",32.341499329999998,-106.4029999]
["WST","Westerly State Airport","US",41.349601745599998,-71.803398132300003]
["WVI","Watsonville Municipal Airport","US",36.935699462899997,-121.7900009155]
["WVL","Waterville Robert Lafleur Airport","US",44.533199310299999,-69.675498962399999]
["WWD","Cape May County Airport","US",39.008499145499997,-74.908302307100001]
["WWR","West Woodward Airport","US",36.438000000000002,-99.522666700000002]
["WYS","Yellowstone Airport","US",44.688400270000002,-111.11799619999999]
["XNA","Northwest Arkansas Regional Airport","US",36.281898498499999,-94.306800842300007]
["XWA","Williston Basin International Airport","US",48.259721999999996,-103.750556]
["YIP","Willow Run Airport","US",42.237899779999999,-83.530403140000004]
["YKM","Yakima Air Terminal McAllister Field","US",46.568199159999999,-120.5439987]
["YKN","Chan Gurney Municipal Airport","US",42.916698455800002,-97.385902404800007]
["YNG","Youngstown Warren Regional Airport","US",41.260700229999998,-80.679100039999994]
["ZPH","Zephyrhills Municipal Airport","US",28.2282009125,-82.155899047899993]
["ZZV","Zanesville Municipal Airport","US",39.944400787399999,-81.892097473099994]
["KFZ","Kukes Airport","AL",42.033699035600002,20.415899276699999]
["TIA","Tirana International Airport Mother Teresa","AL",41.414699554400002,19.720600128200001]
["BOJ","Burgas Airport","BG",42.569599151600002,27.515199661299999]
["GOZ","Gorna Oryahovitsa Airport","BG",43.151401519799997,25.712900161699999]
["HKV","Uzundzhovo Air Base","BG",41.976398467999999,25.589799881000001]
["JAM","Bezmer Air Base","BG",42.454898834200002,26.352199554399999]
["PDV","Plovdiv International Airport","BG",42.067798614499999,24.8507995605]
["PVN","Dolna Mitropoliya Air Base","BG",43.451400756799998,24.5027999878]
["SOF","Sofia Airport","BG",42.696693420400003,23.4114360809]
["SLS","Silistra Polkovnik Lambrinovo Airfield","BG",44.055198669399999,27.178800582899999]
["SZR","Stara Zagora Airport","BG",42.376701355000002,25.655199050899999]
["TGV","Bukhovtsi Airfield","BG",43.306598663300001,26.700899124100001]
["VID","Vidin Smurdan Airfield","BG",44.022399902300002,22.816099166899999]
["VAR","Varna Airport","BG",43.232101440400001,27.8250999451]
["ECN","Ercan International Airport","CY",35.154701232900003,33.496101379400002]
["LCA","Larnaca International Airport","CY",34.875099182100001,33.624900817899999]
["PFO","Paphos International Airport","CY",34.717998504599997,32.4856987]
["AKT","RAF Akrotiri","CY",34.5904006958,32.987899780299998]
["DBV","Dubrovnik Airport","HR",42.561401367199998,18.268199920699999]
["LSZ","Losinj Island Airport","HR",44.565799713099999,14.3930997849]
["OSI","Osijek Airport","HR",45.462699890099998,18.8101997375]
["PUY","Pula Airport","HR",44.893501281699997,13.922200202899999]
["RJK","Rijeka Airport","HR",45.216899871800003,14.570300102199999]
["BWK","Brac Airport","HR",43.285701751700003,16.6797008514]
["SPU","Split Airport","HR",43.538898467999999,16.298000335699999]
["ZAG","Zagreb Airport","HR",45.742900848399998,16.068799972499999]
["ZAD","Zemunik Airport","HR",44.108299255399999,15.3466997147]
["ABC","Albacete-Los Llanos Airport","ES",38.948501586900001,-1.8635200262]
["ALC","Alicante International Airport","ES",38.282199859599999,-0.55815601349999999]
["LEI","Almeria International Airport","ES",36.843898773200003,-2.3701000213999999]
["OVD","Asturias Airport","ES",43.563598632800002,-6.0346198082000004]
["ODB","Cordoba Airport","ES",37.841999053999999,-4.8488798141]
["BIO","Bilbao Airport","ES",43.301101684599999,-2.9106099606]
["RGS","Burgos Airport","ES",42.357601165799998,-3.6207599639999999]
["BCN","Barcelona International Airport","ES",41.297100067099997,2.0784599781000002]
["BJZ","Badajoz Airport","ES",38.8913002014,-6.8213300705000002]
["CDT","Castellon De La Plana Airport","ES",39.999198913599997,2.61109993E-2]
["LCG","A Coruna Airport","ES",43.302101135299999,-8.3772602080999992]
["ECV","Cuatro Vientos Airport","ES",40.370700836200001,-3.7851400375000002]
["ILD","Lleida-Alguaire Airport","ES",41.728185000000003,0.53502300000000003]
["GRO","Girona Airport","ES",41.901000976600002,2.7605500220999999]
["GRX","Federico Garcia Lorca Airport","ES",37.188701629599997,-3.7773599624999998]
["HSK","Huesca/Pirineos Airport","ES",42.0760993958,-0.31666699050000002]
["IBZ","Ibiza Airport","ES",38.872898101799997,1.3731199503]
["XRY","Jerez Airport","ES",36.744598388699998,-6.0601100922000004]
["MJV","San Javier Airport","ES",37.775001525900002,-0.81238901620000004]
["QSA","Sabadell Airport","ES",41.520900726299999,2.1050798892999998]
["LEN","Leon Airport","ES",42.589000701899998,-5.6555600166]
["RJL","Logrono-Agoncillo Airport","ES",42.460953488800001,-2.3222351074000001]
["MAD","Madrid Barajas International Airport","ES",40.493600000000001,-3.5667599999999999]
["HEV","Mafe - Gibraleon Airport","ES",37.364299774199999,-6.9209399222999997]
["AGP","Malaga Airport","ES",36.6749000549,-4.4991102218999997]
["MAH","Menorca Airport","ES",39.862598419199998,4.2186498641999997]
["RMU","Región de Murcia International Airport","ES",37.802999999999997,-1.125]
["OZP","Moron Air Base","ES",37.1749000549,-5.6159400939999999]
["PMI","Palma De Mallorca Airport","ES",39.551700592000003,2.7388100623999998]
["PNA","Pamplona Airport","ES",42.770000457800002,-1.646329999]
["CQM","Ciudad Real Central Airport","ES",38.856389,-3.97]
["REU","Reus Air Base","ES",41.147399902300002,1.1671700478]
["ROZ","Rota Naval Station Airport","ES",36.645198821999998,-6.3494601250000002]
["SLM","Salamanca Airport","ES",40.952098846399998,-5.5019898415000004]
["EAS","San Sebastian Airport","ES",43.356498718300003,-1.7906099557999999]
["SCQ","Santiago de Compostela Airport","ES",42.8963012695,-8.4151401519999993]
["LEU","Aerodrom dels Pirineus-Alt Urgell Airport","ES",42.338600158699997,1.4091700315]
["TEV","Teruel Airport","ES",40.4119444444,-1.2175]
["TOJ","Torrejon Airport","ES",40.496700286900001,-3.4458699226]
["VLC","Valencia Airport","ES",39.489299774199999,-0.48162499069999998]
["VLL","Valladolid Airport","ES",41.7061004639,-4.8519401550000003]
["VIT","Vitoria/Foronda Airport","ES",42.882801055900003,-2.7244699000999999]
["VGO","Vigo Airport","ES",42.231800079300001,-8.6267700195000003]
["SDR","Santander Airport","ES",43.427101135299999,-3.8200099467999999]
["ZAZ","Zaragoza Air Base","ES",41.6661987305,-1.0415500402]
["SVQ","Sevilla Airport","ES",37.417999267600003,-5.8931097984000003]
["DPE","St Aubin Airport","FR",49.882499694800003,1.0852799416000001]
["CQF","Calais-Dunkerque Airport","FR",50.962100982700001,1.9547599553999999]
["XCP","Compiegne Margny Airport","FR",49.434398651099997,2.8061099052]
["XLN","Laon - Chambry Airport","FR",49.5957984924,3.6316699982]
["XSJ","Peronne-Saint-Quentin Airport","FR",49.868499755899997,3.0295801163]
["XDK","Dunkerque Les Moeres Airport","FR",51.040599823000001,2.5502800941000001]
["BYF","Albert-Bray Airport","FR",49.971500396700002,2.6976599693000001]
["LTQ","Le Touquet-Cote d'Opale Airport","FR",50.517398834200002,1.6205899715000001]
["XVS","Valenciennes-Denain Airport","FR",50.325801849400001,3.4612600803000002]
["QAM","Amiens-Glisy Airport","FR",49.8730010986,2.3870699406]
["AGF","Agen-La Garenne Airport","FR",44.174701690699997,0.59055602549999997]
["BOD","Bordeaux-Merignac (BA 106) Airport","FR",44.828300476099997,-0.71555602549999997]
["EGC","Bergerac-Roumaniere Airport","FR",44.825298309300003,0.51861101389999997]
["CNG","Cognac-Chateaubernard (BA 709) Air Base","FR",45.6582984924,-0.3174999952]
["LRH","La Rochelle-Ile de Re Airport","FR",46.179199218800001,-1.1952799559]
["PIS","Poitiers-Biard Airport","FR",46.587699890099998,0.30666598680000001]
["MCU","Montlucon-Domerat Airport","FR",46.352500915500002,2.5704898834000001]
["LIG","Limoges Airport","FR",45.862800598100002,1.1794400215]
["XMJ","Mont-de-Marsan (BA 118) Air Base","FR",43.911701202400003,-0.50749999280000002]
["NIT","Niort-Souche Airport","FR",46.311298370400003,-0.4015029967]
["TLS","Toulouse-Blagnac Airport","FR",43.629100799600003,1.3638199568]
["PUF","Pau Pyrenees Airport","FR",43.3800010681,-0.41861099000000002]
["LDE","Tarbes-Lourdes-Pyrenees Airport","FR",43.178699493400003,-6.4389998999999998E-3]
["ANG","Angouleme-Brie-Champniers Airport","FR",45.729198455800002,0.2214560062]
["BVE","Toul Rosieres Air Base","FR",48.779998779300001,5.9800000191000002]
["PGX","Perigueux-Bassillac Airport","FR",45.198101043699999,0.81555598969999998]
["XDA","Dax Seyresse Airport","FR",43.689201355000002,-1.0688899755000001]
["BIQ","Biarritz-Anglet-Bayonne Airport","FR",43.4683990479,-1.5233199596]
["XCX","Chatellerault Airport","FR",46.781398773200003,0.55194401739999999]
["ZAO","Cahors-Lalbenque Airport","FR",44.351398467999999,1.4752800465]
["XGT","Gueret St Laurent Airport","FR",46.179199218800001,1.9583300351999999]
["XAC","Arcachon-La Teste-de-Buch Airport","FR",44.5964012146,-1.1108299494]
["LBI","Albi-Le Sequestre Airport","FR",43.913898467999999,2.1130599976000002]
["DCM","Castres-Mazamet Airport","FR",43.556301116900002,2.2891800403999998]
["RDZ","Rodez-Marcillac Airport","FR",44.4079017639,2.4826700687000001]
["RYN","Royan-Medis Airport","FR",45.628101348900003,-0.97250002619999998]
["XMW","Montauban Airport","FR",44.025699615500002,1.3780399561000001]
["XLR","Libourne-Artigues-de-Lussac Airport","FR",44.982498168900001,-0.13472199439999999]
["RCO","Rochefort-Saint-Agnant (BA 721) Airport","FR",45.887798309300003,-0.98305600879999999]
["XSL","Sarlat Domme Airport","FR",44.793300628700003,1.2447199820999999]
["XTB","Tarbes Laloubere Airport","FR",43.2160987854,7.8611001400000005E-2]
["IDY","Ile d'Yeu Airport","FR",46.718601226799997,-2.3911099434]
["CMR","Colmar-Houssen Airport","FR",48.109901428199997,7.3590102196]
["XBV","Beaune-Challanges Airport","FR",47.005901336699999,4.8934202194000003]
["DLE","Dole-Tavaux Airport","FR",47.039001464800002,5.4272499084000003]
["XVN","Verdun-Le Rozelier Airport","FR",49.122398376500001,5.4690499305999998]
["MVV","Megeve Airport","FR",45.820800781300001,6.6522197722999996]
["OBS","Aubenas-Ardeche Meridional Airport","FR",44.5442008972,4.3721899985999997]
["LPY","Le Puy-Loudes Airport","FR",45.080699920699999,3.7628901004999999]
["XBK","Bourg-Ceyzeriat Airport","FR",46.200901031500003,5.2920298576000002]
["AHZ","L'alpe D'huez Airport","FR",45.088298797599997,6.0847201347000004]
["XVF","Villefranche-Tarare Airport","FR",45.919983000000002,4.6349309999999999]
["XMU","Moulins-Montbeugny Airport","FR",46.5345993042,3.423719883]
["ETZ","Metz-Nancy-Lorraine Airport","FR",48.982101440400001,6.2513198853]
["ANE","Angers-Loire Airport","FR",47.560298919700003,-0.31222200389999999]
["XAV","Albertville Airport","FR",45.627201080299997,6.3297200202999999]
["BIA","Bastia-Poretta Airport","FR",42.552700042700003,9.4837303162000008]
["CLY","Calvi-Sainte-Catherine Airport","FR",42.530799865699997,8.7931900023999994]
["FSC","Figari Sud-Corse Airport","FR",41.500598907499999,9.0977802276999995]
["AJA","Ajaccio-Napoleon Bonaparte Airport","FR",41.923599243200002,8.8029203415000001]
["PRP","Propriano Airport","FR",41.660598754900001,8.8897495269999993]
["SOZ","Solenzara (BA 126) Air Base","FR",41.924400329599997,9.4060001372999995]
["MFX","Meribel Airport","FR",45.406898498499999,6.5805602073999996]
["AUF","Auxerre-Branches Airport","FR",47.850200653100003,3.4971098899999999]
["CMF","Chambery-Savoie Airport","FR",45.638099670400003,5.8802299500000004]
["CFE","Clermont-Ferrand Auvergne Airport","FR",45.786701202400003,3.1691699028000002]
["BOU","Bourges Airport","FR",47.0581016541,2.3702800274000002]
["XCD","Chalon-Champforgeuil Airport","FR",46.8260993958,4.8176298141]
["QNJ","Annemasse Airport","FR",46.192001342799998,6.2683901786999998]
["CVF","Courchevel Airport","FR",45.396701812700002,6.6347198485999996]
["LYS","Lyon Saint-Exupery Airport","FR",45.726398467999999,5.0908298492000004]
["QNX","Macon-Charnay Airport","FR",46.295101165799998,4.7957701682999998]
["SYT","Saint-Yan Airport","FR",46.412498474099998,4.0132598877000003]
["RNE","Roanne-Renaison Airport","FR",46.058300018300002,4.0013899802999999]
["NCY","Annecy-Haute-Savoie-Mont Blanc Airport","FR",45.929199218800001,6.0987601280000003]
["XMK","Montelimar - Ancone Airport","FR",44.583599090600003,4.7405600548000004]
["GNB","Grenoble-Isere Airport","FR",45.362899780299998,5.3293700218]
["VAF","Valence-Chabeuil Airport","FR",44.921600341800001,4.9699001312000002]
["VHY","Vichy-Charmeil Airport","FR",46.169700622599997,3.4037399291999999]
["AUR","Aurillac Airport","FR",44.891399383500001,2.4219400883]
["CHR","Chateauroux-Deols Marcel Dassault Airport","FR",46.862201690699997,1.7306699753000001]
["LYN","Lyon-Bron Airport","FR",45.727199554400002,4.9442701339999999]
["QXB","Aix-en-Provence (BA 114) Airport","FR",43.505599975599999,5.3677802086000002]
["CEQ","Cannes-Mandelieu Airport","FR",43.541999816900002,6.9534797668000001]
["EBU","Saint-Etienne-Boutheon Airport","FR",45.540599823000001,4.2963900566]
["QIE","Istres Le Tube/Istres Air Base (BA 125) Airport","FR",43.522701263400002,4.9238400458999996]
["CCF","Carcassonne Airport","FR",43.215999603299998,2.306319952]
["MRS","Marseille Provence Airport","FR",43.439271922000003,5.2214241028000004]
["NCE","Nice-Cote d'Azur Airport","FR",43.658401489299997,7.2158699035999998]
["XOG","Orange-Caritat (BA 115) Air Base","FR",44.140499114999997,4.8667201995999996]
["PGF","Perpignan-Rivesaltes (Llabanere) Airport","FR",42.740398407000001,2.8706700802]
["CTT","Le Castellet Airport","FR",43.252498626700003,5.7851901053999999]
["BAE","Barcelonnette - Saint-Pons Airport","FR",44.388301849400001,6.6102800368999999]
["XAS","Ales-Deaux Airport","FR",44.069698333700003,4.1421198844999996]
["MPL","Montpellier-Mediterranee Airport","FR",43.576198577900001,3.9630100726999999]
["BZR","Beziers-Vias Airport","FR",43.323501586900001,3.3538999557000002]
["AVN","Avignon-Caumont Airport","FR",43.9072990417,4.9018301963999997]
["GAT","Gap - Tallard Airport","FR",44.455001831099999,6.0377798079999998]
["MEN","Mende-Brenoux Airport","FR",44.502101898200003,3.5328199862999998]
["SCP","Mont-Dauphin - St-Crepin Airport","FR",44.701698303199997,6.6002798079999998]
["BVA","Paris Beauvais Tille Airport","FR",49.454399108899999,2.1127800941000001]
["XSU","Saumur-Saint-Florent Airport","FR",47.256801605200003,-0.1151420027]
["EVX","Evreux-Fauville (BA 105) Air Base","FR",49.028701782200002,1.2198599577]
["XAN","Alencon Valframbert Airport","FR",48.447498321499999,0.10916700209999999]
["LEH","Le Havre Octeville Airport","FR",49.5339012146,8.8055998100000005E-2]
["XAB","Abbeville-Buigny-Saint-Maclou Airport","FR",50.143501281699997,1.8318899870000001]
["ORE","Orleans-Saint-Denis-de-l'Hotel Airport","FR",47.896900176999999,2.1633300781]
["XCR","Chalons-Vatry Air Base","FR",48.776100158699997,4.1844902039000003]
["LSO","Les Sables-d'Olonne Talmont Airport","FR",46.476898193399997,-1.7227799892]
["URO","Rouen Airport","FR",49.384201049799998,1.1748000382999999]
["XBQ","Blois-Le Breuil Airport","FR",47.678501129200001,1.2088400126000001]
["QTJ","Chartres Champhol Airport","FR",48.458900451700003,1.5238900184999999]
["TUF","Tours-Val-de-Loire Airport","FR",47.432201385500001,0.72760599849999996]
["CET","Cholet Le Pontreau Airport","FR",47.082099914600001,-0.87706398959999998]
["LVA","Laval-Entrammes Airport","FR",48.031398773200003,-0.74298602339999997]
["LBG","Paris-Le Bourget Airport","FR",48.969398498499999,2.4413900375000002]
["CSF","Creil Air Base","FR",49.253501892099997,2.5191400051000001]
["CDG","Charles de Gaulle International Airport","FR",49.012798309300003,2.5499999522999999]
["TNF","Toussus-le-Noble Airport","FR",48.751899719199997,2.1061899662000001]
["ORY","Paris-Orly Airport","FR",48.725299835199998,2.3594400883]
["POX","Pontoise - Cormeilles-en-Vexin Airport","FR",49.096599578899998,2.0408298969000001]
["VIY","Villacoublay-Velizy (BA 107) Air Base","FR",48.774398803700002,2.2015399932999999]
["QYR","Troyes-Barberey Airport","FR",48.322101592999999,4.0166997909999997]
["NVS","Nevers-Fourchambault Airport","FR",47.002601623499999,3.1133298873999999]
["XCB","Cambrai-Epinoy (BA 103) Air Base","FR",50.221801757800002,3.1542398930000002]
["XME","Maubeuge-Elesmes Airport","FR",50.3105010986,4.0331201552999998]
["LIL","Lille-Lesquin Airport","FR",50.561901092500001,3.0894401073000002]
["HZB","Merville-Calonne Airport","FR",50.618400573700001,2.6422400475000001]
["XCZ","Charleville-Mezieres Airport","FR",49.7839012146,4.6470799445999997]
["XVO","Vesoul-Frotey Airport","FR",47.6375999451,6.2039198874999997]
["BES","Brest Bretagne Airport","FR",48.447898864700001,-4.4185400009000002]
["CER","Cherbourg-Maupertus Airport","FR",49.650100707999997,-1.4702800512]
["DNR","Dinard-Pleurtuit-Saint-Malo Airport","FR",48.587699890099998,-2.0799601077999998]
["LBY","La Baule-Escoublac Airport","FR",47.289398193399997,-2.3463900088999998]
["GFR","Granville Airport","FR",48.883098602300002,-1.5641700029000001]
["DOL","Deauville-Saint-Gatien Airport","FR",49.365299224899999,0.15430599449999999]
["LRT","Lorient South Brittany (Bretagne Sud) Airport","FR",47.760601043699999,-3.4400000571999998]
["EDM","La Roche-sur-Yon Airport","FR",46.701900482200003,-1.3786300421]
["LDV","Landivisiau Air Base","FR",48.530300140400001,-4.1516399383999998]
["CFR","Caen-Carpiquet Airport","FR",49.173301696800003,-0.44999998810000003]
["LME","Le Mans-Arnage Airport","FR",47.948600769000002,0.20166699590000001]
["RNS","Rennes-Saint-Jacques Airport","FR",48.069499969500001,-1.7347899675]
["LAI","Lannion-Cote de Granit Airport","FR",48.7543983459,-3.4716598988]
["UIP","Quimper-Cornouaille Airport","FR",47.974998474099998,-4.1677899361000001]
["NTE","Nantes Atlantique Airport","FR",47.153198242199998,-1.6107300520000001]
["SBK","Saint-Brieuc-Armor Airport","FR",48.537799835199998,-2.8544399737999999]
["MXN","Morlaix-Ploujean Airport","FR",48.603199005100002,-3.8157799244000001]
["VNE","Vannes-Meucon Airport","FR",47.723300933799997,-2.7185599803999998]
["SNR","Saint-Nazaire-Montoir Airport","FR",47.3121986389,-2.1491799354999999]
["QBQ","Besancon Thise Airport","FR",47.274700164800002,6.0841698646999998]
["BSL","EuroAirport Basel-Mulhouse-Freiburg Airport","FR",47.589599609399997,7.5299100876000002]
["DIJ","Dijon-Bourgogne Airport","FR",47.268901825,5.0900001526]
["MZM","Metz-Frescaty (BA 128) Air Base","FR",49.071701049799998,6.1316699981999996]
["EPL","Epinal-Mirecourt Airport","FR",48.325000762899997,6.0699801444999997]
["XMF","Montbeliard-Courcelles Airport","FR",47.486999511699999,6.7905402184000003]
["ENC","Nancy-Essey Airport","FR",48.692100524899999,6.2304601669000004]
["BOR","Fontaine Airport","FR",47.655601501500001,7.0108299255000004]
["RHE","Reims-Champagne (BA 112) Airport","FR",49.310001373299997,4.0500001906999996]
["SXB","Strasbourg Airport","FR",48.5382995605,7.6282300949000001]
["VTL","Vittel Champ De Course Airport","FR",48.223899841300003,5.9352798462000003]
["TLN","Toulon-Hyeres Airport","FR",43.097301483199999,6.1460299491999999]
["FRJ","Frejus Airport","FR",43.414699554400002,6.7455601692]
["FNI","Nimes-Arles-Camargue Airport","FR",43.757400512700002,4.4163498878]
["LTT","La Mole Airport","FR",43.205398559599999,6.4819998740999996]
["MQC","Miquelon Airport","PM",47.095500946000001,-56.380298614499999]
["FSP","St Pierre Airport","PM",46.7629013062,-56.173099517799997]
["PYR","Andravida Airport","GR",37.920700073200003,21.292600631700001]
["AGQ","Agrinion Airport","GR",38.602001190199999,21.3512001038]
["AXD","Dimokritos Airport","GR",40.855899810799997,25.956300735500001]
["HEW","Athen Helenikon Airport","GR",37.8932991028,23.726100921600001]
["ATH","Eleftherios Venizelos International Airport","GR",37.936401367199998,23.944499969500001]
["VOL","Nea Anchialos Airport","GR",39.219600677499997,22.794300079300001]
["JKH","Chios Island National Airport","GR",38.343200683600003,26.1406002045]
["PKH","Porto Cheli Airport","GR",37.2975006104,23.147800445600001]
["JIK","Ikaria Airport","GR",37.682701110799997,26.3470993042]
["IOA","Ioannina Airport","GR",39.696399688699998,20.822500228900001]
["HER","Heraklion International Nikos Kazantzakis Airport","GR",35.339698791499998,25.180299758899999]
["KSO","Kastoria National Airport","GR",40.446300506599997,21.282199859599999]
["KIT","Kithira Airport","GR",36.274299621600001,23.017000198400002]
["EFL","Kefallinia Airport","GR",38.120098114000001,20.500499725299999]
["KZS","Kastelorizo Airport","GR",36.141700744600001,29.576400756799998]
["KLX","Kalamata Airport","GR",37.068298339800002,22.025499343900002]
["KGS","Kos Airport","GR",36.793300628700003,27.091699600199998]
["AOK","Karpathos Airport","GR",35.421398162800003,27.1459999084]
["CFU","Ioannis Kapodistrias International Airport","GR",39.601898193399997,19.911699294999998]
["KSJ","Kasos Airport","GR",35.421398162800003,26.909999847400002]
["KVA","Alexander the Great International Airport","GR",40.9132995605,24.6191997528]
["JKL","Kalymnos Airport","GR",36.963298797599997,26.940599441500002]
["KZI","Filippos Airport","GR",40.286098480200003,21.840799331700001]
["LRS","Leros Airport","GR",37.184898376500001,26.800300598100002]
["LXS","Limnos Airport","GR",39.917098998999997,25.236299514799999]
["LRA","Larisa Airport","GR",39.6562825886,22.340000867800001]
["JMK","Mikonos Airport","GR",37.435100555399998,25.3481006622]
["MLO","Milos Airport","GR",36.696899414100002,24.4769001007]
["MJT","Mytilene International Airport","GR",39.056701660199998,26.598300933800001]
["JNX","Naxos Airport","GR",37.0811004639,25.368099212600001]
["PAS","Paros Airport","GR",37.010299682599999,25.128099441500002]
["JTY","Astypalaia Airport","GR",36.579898834200002,26.375799179099999]
["PVK","Aktion National Airport","GR",38.925498962399999,20.7653007507]
["RHO","Diagoras Airport","GR",36.405399322500003,28.086200714099999]
["GPA","Araxos Airport","GR",38.151100158699997,21.425600051899998]
["CHQ","Chania International Airport","GR",35.531700134300003,24.149700164799999]
["JSI","Skiathos Island National Airport","GR",39.177101135299999,23.5037002563]
["SMI","Samos Airport","GR",37.689998626700003,26.911699294999998]
["JSY","Syros Airport","GR",37.422798156699997,24.950899124100001]
["SPJ","Sparti Airport","GR",36.973899841300003,22.526300430300001]
["JTR","Santorini Airport","GR",36.3992004395,25.479299545300002]
["JSH","Sitia Airport","GR",35.2160987854,26.101299285900001]
["SKU","Skiros Airport","GR",38.967601776099997,24.487199783299999]
["SKG","Thessaloniki Macedonia International Airport","GR",40.519699096700002,22.970899581899999]
["ZTH","Dionysios Solomos Airport","GR",37.750900268599999,20.884300231899999]
["BUD","Budapest Ferenc Liszt International Airport","HU",47.436901092500001,19.255599975599999]
["DEB","Debrecen International Airport","HU",47.488899230999998,21.615299224899999]
["MCQ","Miskolc Airport","HU",48.1369018555,20.7914009094]
["PEV","Pecs-Pogany Airport","HU",45.990898132300003,18.240999221799999]
["QGY","Gyor-Per International Airport","HU",47.624401092500001,17.8136005402]
["SOB","Sarmellek International Airport","HU",46.686401367199998,17.159099578900001]
["TZR","Taszar Air Base","HU",46.393100738500003,17.917499542200002]
["QZD","Szeged Glider Airport","HU",46.246898651099997,20.090799331700001]
["QAQ","L'Aquila / Preturo Airport","IT",42.379901885999999,13.309200286899999]
["CRV","Crotone Airport","IT",38.997200012199997,17.080200195300002]
["BRI","Bari / Palese International Airport","IT",41.138900756799998,16.7605991364]
["FOG","Foggia / Gino Lisa Airport","IT",41.432899475100001,15.5349998474]
["TAR","Taranto / Grottaglie Airport","IT",40.517501831099999,17.403200149500002]
["LCC","Lecce Airport","IT",40.239200592000003,18.133300781300001]
["PSR","Pescara International Airport","IT",42.431701660199998,14.181099891700001]
["BDS","Brindisi / Casale Airport","IT",40.6576004028,17.9470005035]
["SUF","Lamezia Terme Airport","IT",38.905399322500003,16.242300033599999]
["CIY","Comiso Airport Vincenzo Magliocco","IT",36.994601020799998,14.6071815491]
["CTA","Catania / Fontanarossa Airport","IT",37.466800689700001,15.0663995743]
["LMP","Lampedusa Airport","IT",35.497898101799997,12.6181001663]
["PNL","Pantelleria Airport","IT",36.8165016174,11.9688997269]
["PMO","Palermo / Punta Raisi Airport","IT",38.175998687700002,13.0909996033]
["REG","Reggio Calabria Airport","IT",38.071201324500002,15.651599883999999]
["TPS","Trapani / Birgi Airport","IT",37.911399841300003,12.4879999161]
["NSY","Sigonella Airport","IT",37.401699066200003,14.9224004745]
["BLX","Belluno Airport","IT",46.167499542199998,12.2479000092]
["CDF","Cortina Airport","IT",46.573001861599998,12.118000030499999]
["RAN","Ravenna Airport","IT",44.364299774199999,12.224900245700001]
["ZIA","Ramenskoye Airport","RU",55.553298950200002,38.150001525900002]
["AHO","Alghero / Fertilia Airport","IT",40.632099151600002,8.2907695770000007]
["DCI","Decimomannu Airport","IT",39.354198455800002,8.9724798203000002]
["CAG","Cagliari / Elmas Airport","IT",39.251499176000003,9.0542802811000005]
["OLB","Olbia / Costa Smeralda Airport","IT",40.898700714100002,9.5176296233999995]
["FNU","Oristano / Fenosu Airport","IT",39.894298553500001,8.6403999328999994]
["TTB","Tortoli' / Arbatax Airport","IT",39.918800353999998,9.6829795836999999]
["QVA","Varese / Venegono Airport","IT",45.742198944099997,8.8882303238000002]
["QMM","Massa Cinquale Airport","IT",43.986000060999999,10.1428003311]
["MXP","Malpensa International Airport","IT",45.630599975599999,8.7281103134000002]
["BGY","Bergamo / Orio Al Serio Airport","IT",45.6739006042,9.7041702271000005]
["TRN","Torino / Caselle International Airport","IT",45.200801849400001,7.6496300696999997]
["ALL","Villanova D'Albenga International Airport","IT",44.0505981445,8.1274299622000008]
["GOA","Genova / Sestri Cristoforo Colombo Airport","IT",44.4132995605,8.8374996185000008]
["LIN","Linate Airport","IT",45.445098877,9.2767400741999992]
["PMF","Parma Airport","IT",44.824501037600001,10.296400070200001]
["QPZ","Piacenza Airport","IT",44.913101196299998,9.7233295441000003]
["AOT","Aosta Airport","IT",45.738498687700002,7.3687200545999998]
["CUF","Cuneo / Levaldigi Airport","IT",44.547000885000003,7.6232199668999998]
["AVB","Aviano Air Base","IT",46.031898498499999,12.5965003967]
["BZO","Bolzano Airport","IT",46.460201263400002,11.326399803199999]
["UDN","Udine / Campoformido Air Base","IT",46.032199859599999,13.1868000031]
["BLQ","Bologna / Borgo Panigale Airport","IT",44.535400390600003,11.2887001038]
["TSF","Treviso / Sant'Angelo Airport","IT",45.648399353000002,12.1943998337]
["FRL","Forli Airport","IT",44.194801330600001,12.0700998306]
["VBS","Brescia / Montichiari Airport","IT",45.428901672400002,10.3305997849]
["TRS","Trieste / Ronchi Dei Legionari","IT",45.8274993896,13.4722003937]
["RMI","Rimini / Miramare - Federico Fellini International Airport","IT",44.0203018188,12.611700058]
["VIC","Vicenza Airport","IT",45.573398590099998,11.529500007599999]
["QPA","Padova Airport","IT",45.395801544199998,11.8479003906]
["VRN","Verona / Villafranca Airport","IT",45.395698547400002,10.8885002136]
["AOI","Ancona / Falconara Airport","IT",43.616298675499998,13.3622999191]
["VCE","Venezia / Tessera -  Marco Polo Airport","IT",45.505298614499999,12.3519001007]
["QZO","Arezzo Airport","IT",43.455898284900002,11.847000122100001]
["LCV","Lucca / Tassignano Airport","IT",43.828201293900001,10.5781002045]
["QRT","Rieti Airport","IT",42.427200317400001,12.851699829099999]
["SAY","Siena / Ampugnano Airport","IT",43.256301879900001,11.2550001144]
["CIA","Ciampino Airport","IT",41.799400329599997,12.594900131199999]
["FCO","Leonardo Da Vinci (Fiumicino) International Airport","IT",41.804500579799999,12.2508001328]
["QFR","Frosinone Military Airport","IT",41.646400451700003,13.2997999191]
["QSR","Salerno / Pontecagnano Airport","IT",40.620399475100001,14.911299705499999]
["EBA","Marina Di Campo Airport","IT",42.760299682599999,10.239399909999999]
["QLT","Latina Airport","IT",41.542400360099997,12.9090003967]
["NAP","Napoli / Capodichino International Airport","IT",40.886001586900001,14.2908000946]
["PSA","Pisa / San Giusto - Galileo Galilei International Airport","IT",43.683898925800001,10.3927001953]
["FLR","Firenze / Peretola Airport","IT",43.810001373299997,11.205100059499999]
["GRS","Grosseto Airport","IT",42.759700775100001,11.0719003677]
["PEG","Perugia / San Egidio Airport","IT",43.095901489299997,12.513199806199999]
["LJU","Ljubljana Joze Pucnik Airport","SI",46.223701477100001,14.4575996399]
["MBX","Maribor Airport","SI",46.479900360099997,15.6861000061]
["POW","Portoroz Airport","SI",45.473400116000001,13.614999771100001]
["GTW","Holesov Airport","CZ",49.314399719199997,17.568899154699999]
["UHE","Kunovice Airport","CZ",49.029399871800003,17.439699173000001]
["KLV","Karlovy Vary International Airport","CZ",50.202999114999997,12.9149999619]
["MKA","Marianske Lazne Airport","CZ",49.922798156699997,12.7246999741]
["OSR","Ostrava Leos Janacek Airport","CZ",49.696300506599997,18.111099243200002]
["OLO","Olomouc Glider Airport","CZ",49.587799072300001,17.210800170900001]
["PED","Pardubice Airport","CZ",50.013401031500003,15.738599777199999]
["PRV","Prerov Air Base","CZ",49.425800323499999,17.404699325599999]
["PRG","Vaclav Havel Airport","CZ",50.1007995605,14.260000228899999]
["BRQ","Brno-Turany Airport","CZ",49.151298522899999,16.694400787399999]
["VOD","Vodochody Airport","CZ",50.216598510700003,14.3957996368]
["ZBE","Zabreh Ostrava Airport","CZ",49.928298950200002,18.078300476100001]
["TLV","Ben Gurion International Airport","IL",32.011398315400001,34.886699676500001]
["BEV","Be'er Sheva (Teyman) Airport","IL",31.287000656099998,34.722999572799999]
["ETM","Ramon Airport","IL",29.723693999999998,35.011417000000002]
["ETH","Eilat Airport","IL",29.561300277699999,34.960098266599999]
["EIY","Ein Yahav Airfield","IL",30.621700286900001,35.203300476099997]
["HFA","Haifa International Airport","IL",32.809398651099997,35.043098449699997]
["RPN","Ben Ya'akov Airport","IL",32.980998992899998,35.571899414100002]
["KSW","Kiryat Shmona Airport","IL",33.2167015076,35.599998474099998]
["MIP","Ramon Air Base","IL",30.7761001587,34.666698455800002]
["MTZ","Bar Yehuda Airfield","IL",31.328199386600001,35.3885993958]
["VTM","Nevatim Air Base","IL",31.2082996368,35.012298584]
["VDA","Ovda International Airport","IL",29.9402999878,34.935798644999998]
["SDV","Sde Dov Airport","IL",32.114700317400001,34.782199859599999]
["YOT","Yotvata Airfield","IL",29.906200408899998,35.066699981699998]
["MLA","Luqa Airport","MT",35.857498,14.477499999999999]
["HOH","Hohenems-Dornbirn Airport","AT",47.384998321499999,9.6999998092999995]
["GRZ","Graz Airport","AT",46.991100311300002,15.4395999908]
["INN","Innsbruck Airport","AT",47.260200500499998,11.3439998627]
["KLU","Klagenfurt Airport","AT",46.642501831099999,14.3376998901]
["LNZ","Linz Airport","AT",48.233200073200003,14.1875]
["SZG","Salzburg Airport","AT",47.793300628700003,13.0043001175]
["VIE","Vienna International Airport","AT",48.110298156699997,16.569700241100001]
["SMA","Santa Maria Airport","PT",36.9714012146,-25.170600891100001]
["BGC","Braganca Airport","PT",41.857799530000001,-6.7071299553000001]
["BYJ","Beja International Airport","PT",38.078899383500001,-7.9324002266000004]
["BGZ","Braga Municipal Aerodrome","PT",41.587100982700001,-8.4451398849999997]
["CHV","Chaves Airport","PT",41.722324371299997,-7.4631500244]
["CBP","Coimbra Airport","PT",40.157199859599999,-8.4700002669999996]
["CVU","Corvo Airport","PT",39.6715011597,-31.113599777200001]
["CAT","New Bight Airport","BS",24.3152999878,-75.452301025400004]
["COV","Covilha Airport","PT",40.264801025399997,-7.4799599647999999]
["FLW","Flores Airport","PT",39.455299377400003,-31.131399154699999]
["FAO","Faro Airport","PT",37.014400482200003,-7.9659099579000001]
["GRW","Graciosa Airport","PT",39.092201232900003,-28.029800415]
["HOR","Horta Airport","PT",38.519901275599999,-28.715900421099999]
["TER","Lajes Field","PT",38.761798858600002,-27.090799331700001]
["FNC","Madeira Airport","PT",32.697898864700001,-16.774499893200002]
["PDL","Joao Paulo II Airport","PT",37.741199493400003,-25.697900772099999]
["PIX","Pico Airport","PT",38.554298400900002,-28.4412994385]
["PRM","Portimao Airport","PT",37.149299621600001,-8.5839595795000001]
["OPO","Francisco de Sa Carneiro Airport","PT",41.248100280800003,-8.6813898087000005]
["PXO","Porto Santo Airport","PT",33.073398590099998,-16.350000381499999]
["LIS","Lisbon Portela Airport","PT",38.781299591100002,-9.1359195709000005]
["SIE","Sines Airport","PT",37.941692352300002,-8.8173007964999996]
["SJZ","Sao Jorge Airport","PT",38.665500640899999,-28.175800323499999]
["VRL","Vila Real Airport","PT",41.274299621600001,-7.7204699516000002]
["VSE","Viseu Airport","PT",40.725498199500002,-7.8889899253999998]
["BNX","Banja Luka International Airport","BA",44.941398620599998,17.2975006104]
["OMO","Mostar International Airport","BA",43.2829017639,17.845899581899999]
["SJJ","Sarajevo International Airport","BA",43.824600219700002,18.3314990997]
["TZL","Tuzla International Airport","BA",44.458698272699998,18.724800109899999]
["ARW","Arad International Airport","RO",46.176601409900002,21.2619991302]
["BCM","Bacau Airport","RO",46.521900176999999,26.9102993011]
["BAY","Tautii Magheraus Airport","RO",47.658401489299997,23.469999313399999]
["BBU","Baneasa International Airport","RO",44.503200530999997,26.102100372300001]
["GHV","Brasov Airport","RO",45.706220000000002,25.523520000000001]
["CND","Mihail Kogalniceanu International Airport","RO",44.362201690699997,28.488300323499999]
["CLJ","Cluj-Napoca International Airport","RO",46.785198211699999,23.6861991882]
["CSB","Caransebes Airport","RO",45.419998168900001,22.253299713099999]
["CRA","Craiova Airport","RO",44.318099975599999,23.8885993958]
["IAS","Iasi Airport","RO",47.178501129200001,27.620599746700002]
["OMR","Oradea International Airport","RO",47.025299072300001,21.902500152599998]
["OTP","Henri Coanda International Airport","RO",44.572200775100001,26.102199554399999]
["SBZ","Sibiu International Airport","RO",45.785598754900001,24.091299057000001]
["SUJ","Satu Mare Airport","RO",47.703300476099997,22.885700225800001]
["SCV","Suceava Stefan cel Mare Airport","RO",47.6875,26.354099273700001]
["TCE","Tulcea Airport","RO",45.0625,28.7143001556]
["TGM","Transilvania Targu Mures International Airport","RO",46.4677009583,24.412500381499999]
["TSR","Timisoara Traian Vuia Airport","RO",45.809898376500001,21.337900161699999]
["GVA","Geneva Cointrin International Airport","CH",46.2380981445,6.1089501381]
["QLS","Lausanne-la Blecherette Airport","CH",46.545299530000001,6.6166701317000003]
["QNC","Neuchatel Airport","CH",46.957500457800002,6.8647198676999999]
["SIR","Sion Airport","CH",46.219600677499997,7.3267598152]
["EML","Emmen Airport","CH",47.0923995972,8.3051204681000002]
["ZIN","Interlaken Air Base","CH",46.676601409900002,7.8790798187000002]
["LUG","Lugano Airport","CH",46.004299163799999,8.9105796813999998]
["BRN","Bern Belp Airport","CH",46.914100646999998,7.4971499443000003]
["BXO","Buochs Airport","CH",46.9744444444,8.3969444444000008]
["ZHI","Grenchen Airport","CH",47.181598663300001,7.4171900748999997]
["ZRH","Zurich Airport","CH",47.464698791499998,8.5491695403999994]
["ZJI","Locarno Airport","CH",46.160800933799997,8.8786096573000002]
["MLH","EuroAirport Basel-Mulhouse-Freiburg Airport","CH",47.589599609399997,7.5299100876000002]
["ACH","St Gallen Altenrhein Airport","CH",47.4850006104,9.5607700348000009]
["SMV","Samedan Airport","CH",46.534099578899998,9.8841104506999997]
["ESB","Esenboga International Airport","TR",40.128101348900003,32.995098114000001]
["ANK","Etimesgut Air Base","TR",39.949798584,32.688598632800002]
["ADA","Adana Airport","TR",36.982200622599997,35.280399322500003]
["UAB","Incirlik Air Base","TR",37.002101898200003,35.4258995056]
["AFY","Afyon Airport","TR",38.726398467999999,30.601100921600001]
["AYT","Antalya International Airport","TR",36.898700714100002,30.8005008698]
["GZT","Gaziantep International Airport","TR",36.947200775100001,37.4786987305]
["KFS","Kastamonu Airport","TR",41.314201355000002,33.795799255399999]
["KYA","Konya Airport","TR",37.9790000916,32.561901092500001]
["MZH","Amasya Merzifon Airport","TR",40.829399108899999,35.521999359100001]
["SSX","Samsun Samair Airport","TR",41.2786445618,36.3051795959]
["VAS","Sivas Airport","TR",39.8138008118,36.903499603299998]
["ONQ","Zonguldak Airport","TR",41.506401062000002,32.088600158699997]
["MLX","Malatya Erhac Airport","TR",38.435298919700003,38.090999603299998]
["ASR","Kayseri Erkilet Airport","TR",38.770401001000003,35.495399475100001]
["TJK","Tokat Airport","TR",40.307430267299999,36.367408752400003]
["DNZ","Cardak Airport","TR",37.785598754900001,29.701299667400001]
["NAV","Nevsehir Kapadokya International Airport","TR",38.771900176999999,34.534500122099999]
["ISL","Ataturk International Airport","TR",40.976898193399997,28.814599990800001]
["CII","Cildir Airport","TR",37.814998626700003,27.8952999115]
["BTZ","Yala Betong International Airport","TH",5.7862881000000002,101.1475228]
["BZI","Balikesir Merkez Airport","TR",39.619300842299999,27.9260005951]
["BDM","Bandirma Airport","TR",40.318000793499998,27.977699279799999]
["CKZ","Canakkale Airport","TR",40.137699127200001,26.426799774199999]
["ESK","Eskisehir Air Base","TR",39.784099578899998,30.582099914600001]
["ADB","Adnan Menderes International Airport","TR",38.292400360099997,27.156999588000001]
["IGL","Cigli Airport","TR",38.513000488300001,27.010099410999999]
["USQ","Usak Airport","TR",38.681499481199999,29.471700668299999]
["KCO","Cengiz Topel Airport","TR",40.7350006104,30.0832996368]
["YEI","Bursa Yenisehir Airport","TR",40.255199432399998,29.562599182100001]
["DLM","Dalaman International Airport","TR",36.713100433299999,28.792499542200002]
["TEQ","Tekirdag Corlu Airport","TR",41.138198852499997,27.9190998077]
["BXN","Imsik Airport","TR",37.140098571800003,27.669700622600001]
["AOE","Anadolu University Airport","TR",39.809898376500001,30.519399642900002]
["KZR","Zafer Airport","TR",39.109024699999999,30.1371297052]
["EZS","Elazig Airport","TR",38.606899261499997,39.291400909399997]
["OGU","Ordu–Giresun Airport","TR",40.966667000000001,38.08]
["DIY","Diyarbakir Airport","TR",37.893901825,40.201000213599997]
["ERC","Erzincan Airport","TR",39.710201263400002,39.527000427200001]
["ERZ","Erzurum International Airport","TR",39.956501007100002,41.1702003479]
["KSY","Kars Airport","TR",40.5621986389,43.115001678500001]
["TZX","Trabzon International Airport","TR",40.995098114000001,39.789699554400002]
["SFQ","Sanliurfa Airport","TR",37.094299316399997,38.8470993042]
["VAN","Van Ferit Melen Airport","TR",38.468200683600003,43.332298278800003]
["BAL","Batman Airport","TR",37.929000854500003,41.116600036599998]
["MSR","Mus Airport","TR",38.747798919700003,41.661201477100001]
["SXZ","Siirt Airport","TR",37.978900909399997,41.8404006958]
["NOP","Sinop Airport","TR",42.015800476099997,35.066398620599998]
["KCM","Kahramanmaras Airport","TR",37.538825988799999,36.9535217285]
["AJI","Agri Airport","TR",39.654541015600003,43.025978088400002]
["ADF","Adiyaman Airport","TR",37.7313995361,38.468898773200003]
["MQM","Mardin Airport","TR",37.223300933799997,40.631698608400001]
["GNY","Sanliurfa GAP Airport","TR",37.4456634521,38.895591735799997]
["IGD","Igdir Airport","TR",39.976627349899999,43.876647949199999]
["YKO","Hakkari Yuksekova Airport","TR",37.551667000000002,44.233611000000003]
["HTY","Hatay Airport","TR",36.362777710000003,36.282222747799999]
["ISE","Suleyman Demirel International Airport","TR",37.855400085399999,30.368400573700001]
["EDO","Balikesir Korfez Airport","TR",39.554599762000002,27.013799667400001]
["BJV","Milas Bodrum International Airport","TR",37.250598907499999,27.664300918599999]
["GZP","Gazipasa Airport","TR",36.299217224099998,32.3005981445]
["SZF","Samsun Carsamba Airport","TR",41.254501342799998,36.567100524899999]
["SAW","Sabiha Gokcen International Airport","TR",40.898601532000001,29.309200286900001]
["GKD","Imroz Airport","TR",40.204498291,25.883300781199999]
["IST","Istanbul Airport","TR",41.262222000000001,28.727778000000001]
["RZV","Rize–Artvin Airport","TR",41.169167000000002,40.828888999999997]
["BZY","Balti International Airport","MD",47.838100433299999,27.781499862699999]
["RMO","Chisinau International Airport","MD",46.927700042700003,28.9309997559]
["OHD","Ohrid St. Paul the Apostle Airport","MK",41.180000305199997,20.742300033599999]
["SKP","Skopje Alexander the Great Airport","MK",41.961601257300003,21.621400833100001]
["GIB","Gibraltar Airport","GI",36.151199340799998,-5.3496599196999997]
["BEG","Belgrade Nikola Tesla Airport","RS",44.818401336699999,20.309099197399998]
["IVG","Berane Airport","ME",42.839000701899998,19.861999511699999]
["BJY","Batajnica Air Base","RS",44.935299000000001,20.2575]
["INI","Nis Airport","RS",43.337299000000002,21.853701000000001]
["QND","Cenej Airport","RS",45.385798999999999,19.839199000000001]
["TGD","Podgorica Airport","ME",42.359401702900001,19.251899719200001]
["TIV","Tivat Airport","ME",42.404701232900003,18.723300933800001]
["UZC","Ponikve Airport","RS",43.898899,19.697700999999999]
["QWV","Divci Airport","RS",44.297816666700001,20.0219111111]
["ZRE","Zrenjanin Airport","RS",45.339756000000001,20.454077999999999]
["BTS","M. R. Stefanik Airport","SK",48.1702003479,17.212699890100001]
["KSC","Kosice Airport","SK",48.663101196299998,21.241100311299999]
["LUE","Lucenec Airport","SK",48.339401245099999,19.735799789400001]
["PZY","Piestany Airport","SK",48.625198364299997,17.828399658199999]
["POV","Presov Air Base","SK",49.029701232900003,21.315599441500002]
["SLD","Sliac Airport","SK",48.637798309300003,19.134099960299999]
["TAT","Poprad-Tatry Airport","SK",49.073600769000002,20.241100311299999]
["ILZ","Zilina Airport","SK",49.231498718300003,18.6135005951]
["GDT","JAGS McCartney International Airport","TC",21.444499969500001,-71.142303466800001]
["MDS","Middle Caicos Airport","TC",21.82602,-71.802499999999995]
["NCA","North Caicos Airport","TC",21.917499542200002,-71.939598083500002]
["PIC","Pine Cay Airport","TC",21.899999618500001,-72.099998474100005]
["PLS","Providenciales Airport","TC",21.773599624599999,-72.265899658199999]
["XSC","South Caicos Airport","TC",21.515699386600001,-71.528503418]
["SLX","Salt Cay Airport","TC",21.333000183100001,-71.199996948199995]
["EPS","Samana El Portillo Airport","DO",19.3214150435,-69.495912194300004]
["BRX","Maria Montez International Airport","DO",18.251499175999999,-71.120399475100001]
["CBJ","Cabo Rojo Airport","DO",17.9290008545,-71.644798278799996]
["AZS","Samana El Catey International Airport","DO",19.267000198400002,-69.741996765099998]
["COZ","Constanza Dom Re Airport","DO",18.907499313399999,-70.721900939899996]
["JBQ","La Isabela International Airport","DO",18.572500228900001,-69.985603332500006]
["LRM","Casa De Campo International Airport","DO",18.450700759899998,-68.911796569800003]
["PUJ","Punta Cana International Airport","DO",18.567399978600001,-68.363403320299994]
["POP","Gregorio Luperon International Airport","DO",19.757900238000001,-70.569999694800003]
["SNX","Semnan Airport","IR",35.5910987854,53.495098114000001]
["SDQ","Las Americas International Airport","DO",18.4297008514,-69.6688995361]
["STI","Cibao International Airport","DO",19.406099319500001,-70.604698181200007]
["CBV","Coban Airport","GT",15.4689998627,-90.406700134299996]
["CIQ","Chiquimula Airport","GT",14.830920000000001,-89.520938000000001]
["CMM","Carmelita Airport","GT",17.461200714099999,-90.053703308099998]
["CTF","Coatepeque Airport","GT",14.6941995621,-91.882499694800003]
["DON","Dos Lagunas Airport","GT",17.6124000549,-89.688400268600006]
["GUA","La Aurora Airport","GT",14.5832996368,-90.527496337900004]
["HUG","Huehuetenango Airport","GT",15.3274002075,-91.462402343799994]
["MCR","Melchor de Mencos Airport","GT",17.068609237699999,-89.152221679700006]
["PBR","Puerto Barrios Airport","GT",15.7308998108,-88.5838012695]
["PCG","Paso Caballos Airport","GT",17.263900756799998,-90.256301879899993]
["PKJ","Playa Grande Airport","GT",15.9975004196,-90.741699218799994]
["PON","Poptun Airport","GT",16.325799942,-89.416099548299997]
["AQB","Santa Cruz del Quiche Airport","GT",15.012200355499999,-91.150596618700007]
["AAZ","Quezaltenango Airport","GT",14.8655996323,-91.5019989014]
["RUV","Rubelsanto Airport","GT",15.9919996262,-90.445297241199995]
["LCF","Las Vegas Airport","GT",15.6688995361,-88.957901000999996]
["RER","Retalhuleu Airport","GT",14.5209999084,-91.697303771999998]
["GSJ","San Jose Airport","GT",13.936200141900001,-90.835800170900001]
["FRS","Mundo Maya International Airport","GT",16.913799285900001,-89.866401672400002]
["UAX","Uaxactun Airport","GT",17.393888473499999,-89.632743835400007]
["AHS","Ahuas Airport","HN",15.4722003937,-84.352203369099996]
["BHG","Brus Laguna Airport","HN",15.763099670400001,-84.543601989699994]
["CAA","Catacamas Airport","HN",14.916999816900001,-85.900001525899995]
["CYL","Coyoles Airport","HN",15.445555687000001,-86.675277710000003]
["CDD","Cauquira Airport","HN",15.3166666031,-83.591667175300003]
["OAN","El Arrayan Airport","HN",15.5055561066,-86.574722289999997]
["GAC","Gracias Airport","HN",14.596667289699999,-88.5941696167]
["IRN","Iriona Airport","HN",15.9391670227,-85.137222289999997]
["JUT","Jutigalpa airport","HN",14.6526002884,-86.220298767100005]
["LCE","Goloson International Airport","HN",15.7425003052,-86.852996826199998]
["LEZ","La Esperanza Airport","HN",14.2911109924,-88.175003051800005]
["SAP","Ramon Villeda Morales International Airport","HN",15.4525995255,-87.923599243200002]
["GJA","La Laguna Airport","HN",16.445400238000001,-85.906600952100007]
["PCH","Palacios Airport","HN",15.954999923700001,-84.941390991199995]
["PEU","Puerto Lempira Airport","HN",15.262200355499999,-83.781196594199997]
["XPL","Coronel Enrique Soto Cano Air Base","HN",14.382399559,-87.621200561500004]
["RTB","Juan Manuel Galvez International Airport","HN",16.316799163799999,-86.523002624499995]
["SDH","Santa Rosa Copan Airport","HN",14.814900398300001,-88.751502990700004]
["RUY","Copan Ruinas Airport","HN",14.8402996063,-89.143997192399993]
["TEA","Tela Airport","HN",15.7758998871,-87.475799560499993]
["TGU","Toncontin International Airport","HN",14.0608997345,-87.217201232899995]
["TJI","Trujillo Airport","HN",15.926799774199999,-85.938201904300001]
["SCD","Sulaco Airport","HN",14.9071998596,-87.263397216800001]
["UII","Utila Airport","HN",16.113100051899998,-86.8803024292]
["OCJ","Boscobel Aerodrome","JM",18.404199600199998,-76.969001770000006]
["KIN","Norman Manley International Airport","JM",17.935699462900001,-76.787498474100005]
["MBJ","Sangster International Airport","JM",18.5037002563,-77.913398742699997]
["POT","Ken Jones Airport","JM",18.1987991333,-76.534500122099999]
["NEG","Negril Airport","JM",18.342800140400001,-78.332099914599993]
["KTP","Tinson Pen Airport","JM",17.988599777200001,-76.8237991333]
["MIJ","Mili Island Airport","MH",6.0833301543999996,171.73300170900001]
["ACA","General Juan N Alvarez International Airport","MX",16.757099151599999,-99.753997802699999]
["NTR","Del Norte International Airport","MX",25.865600585900001,-100.23699951170001]
["AGU","Jesus Teran International Airport","MX",21.705600738499999,-102.318000793]
["HUX","Bahias de Huatulco International Airport","MX",15.7753000259,-96.262603759800001]
["CNA","Cananea Airport","MX",31.066150154900001,-110.097877979]
["CVJ","General Mariano Matamoros Airport","MX",18.834800720200001,-99.2612991333]
["ACN","Ciudad Acuna New International Airport","MX",29.332899093599998,-101.0989990234]
["CME","Ciudad del Carmen International Airport","MX",18.653699874899999,-91.799003601099997]
["NCG","Nuevo Casas Grandes Airport","MX",30.397399902299998,-107.875]
["CUL","Federal de Bachigualato International Airport","MX",24.764499664300001,-107.474998474]
["CTM","Chetumal International Airport","MX",18.504699707,-88.326797485399993]
["CEN","Ciudad Obregon International Airport","MX",27.392599105799999,-109.8330001831]
["CJT","Comitan Airport","MX",16.176700592,-92.0505981445]
["CPE","Ingeniero Alberto Acuna Ongay International Airport","MX",19.816799163799999,-90.500297546400006]
["CJS","Abraham Gonzalez International Airport","MX",31.636100768999999,-106.4290008545]
["CZA","Chichen Itza International Airport","MX",20.6413002014,-88.446197509800001]
["CUU","General Roberto Fierro Villalobos International Airport","MX",28.702899932899999,-105.96499633800001]
["CVM","General Pedro Jose Mendez International Airport","MX",23.703300476100001,-98.956497192399993]
["CYW","Captain Rogelio Castillo National Airport","MX",20.545999526999999,-100.8870010376]
["CZM","Cozumel International Airport","MX",20.522399902299998,-86.9255981445]
["CUA","Ciudad Constitucion Airport","MX",25.053800582899999,-111.6149978638]
["MMC","Ciudad Mante National Airport","MX",22.7431774139,-99.017372131299993]
["DGO","General Guadalupe Victoria International Airport","MX",24.124200820900001,-104.527999878]
["TPQ","Amado Nervo National Airport","MX",21.419500351,-104.8430023193]
["ESE","Ensenada Airport","MX",31.795299530000001,-116.6029968262]
["GDL","Don Miguel Hidalgo Y Costilla International Airport","MX",20.5217990875,-103.3109970093]
["GYM","General Jose Maria Yanez International Airport","MX",27.968999862699999,-110.9250030518]
["GUB","Guerrero Negro Airport","MX",28.0261001587,-114.0240020752]
["TCN","Tehuacan Airport","MX",18.4972000122,-97.419898986800007]
["HMO","General Ignacio P. Garcia International Airport","MX",29.095899581899999,-111.047996521]
["CLQ","Lic. Miguel de la Madrid Airport","MX",19.277000427200001,-103.577003479]
["ISJ","Isla Mujeres Airport","MX",21.245000839199999,-86.739997863799999]
["SLW","Plan De Guadalupe International Airport","MX",25.549499511699999,-100.9290008545]
["IZT","Ixtepec Airport","MX",16.449300766,-95.093696594199997]
["JAL","El Lencero Airport","MX",19.475099563600001,-96.797500610399993]
["AZP","Atizapan De Zaragoza Airport","MX",19.5748004913,-99.288803100600006]
["LZC","Lazaro Cardenas Airport","MX",18.0016994476,-102.221000671]
["LMM","Valle del Fuerte International Airport","MX",25.6851997375,-109.081001282]
["BJX","Del Bajio International Airport","MX",20.9934997559,-101.481002808]
["LAP","Manuel Marquez de Leon International Airport","MX",24.072700500500002,-110.361999512]
["LTO","Loreto International Airport","MX",25.989200592,-111.34799957280001]
["MAM","General Servando Canales International Airport","MX",25.769899368299999,-97.525299072300001]
["MID","Licenciado Manuel Crescencio Rejon Int Airport","MX",20.937000274700001,-89.657699585000003]
["MUG","Mulege Airport","MX",26.897310257000001,-111.9575500488]
["MXL","General Rodolfo Sanchez Taboada International Airport","MX",32.630599975599999,-115.241996765]
["MLM","General Francisco J. Mujica International Airport","MX",19.849899292,-101.025001526]
["MTT","Minatitlan/Coatzacoalcos National Airport","MX",18.103399276699999,-94.580703735399993]
["LOV","Monclova International Airport","MX",26.955699920699999,-101.4700012207]
["MEX","Licenciado Benito Juarez International Airport","MX",19.436300277699999,-99.072097778300005]
["MTY","General Mariano Escobedo International Airport","MX",25.778499603299998,-100.10700225799999]
["MZT","General Rafael Buelna International Airport","MX",23.1613998413,-106.26599883999999]
["NOG","Nogales International Airport","MX",31.226100921600001,-110.9759979248]
["NLD","Quetzalcoatl International Airport","MX",27.443899154699999,-99.570503234900002]
["OAX","Xoxocotlan International Airport","MX",16.999900817899999,-96.726600646999998]
["PAZ","El Tajin National Airport","MX",20.602699279799999,-97.460800170900001]
["PBC","Hermanos Serdan International Airport","MX",19.158100128200001,-98.371398925799994]
["PPE","Puerto Penasco International Airport","MX",31.356202302,-113.525676727]
["PDS","Piedras Negras International Airport","MX",28.627399444600002,-100.5350036621]
["PCO","Punta Colorada Airport","MX",23.575011,-109.535826]
["UPN","Licenciado y General Ignacio Lopez Rayon Airport","MX",19.396699905399998,-102.03900146479999]
["PQM","Palenque International Airport","MX",17.533399581899999,-91.984497070299994]
["PVR","Licenciado Gustavo Diaz Ordaz International Airport","MX",20.680099487300001,-105.2539978027]
["PXM","Puerto Escondido International Airport","MX",15.876899719200001,-97.089103698700001]
["QRO","Queretaro Intercontinental Airport","MX",20.617300033599999,-100.185997009]
["REX","General Lucio Blanco International Airport","MX",26.008899688700001,-98.228500366199995]
["SZT","San Cristobal De Las Casas Airport","MX",16.6902999878,-92.530097961400003]
["SJD","Los Cabos International Airport","MX",23.1518001556,-109.72100067140001]
["SFH","San Felipe International Airport","MX",30.930200576800001,-114.8089981079]
["CSL","Cabo San Lucas International Airport","MX",22.947700500500002,-109.93699646]
["NLU","Felipe Angeles International Airport","MX",19.756667,-99.015277999999995]
["SLP","Ponciano Arriaga International Airport","MX",22.254299163799999,-100.93099975600001]
["TXA","Tlaxcala Airport","MX",19.538000106799998,-98.173500060999999]
["TRC","Francisco Sarabia International Airport","MX",25.5683002472,-103.41100311300001]
["TGZ","Angel Albino Corzo International Airport","MX",16.5636005402,-93.022499084499998]
["TIJ","General Abelardo L. Rodriguez International Airport","MX",32.541099548299997,-116.9700012207]
["TQO","Felipe Carrillo Puerto International Airport","MX",20.166667,-87.666667000000004]
["TAM","General Francisco Javier Mina International Airport","MX",22.296400070200001,-97.865898132300003]
["TSL","Tamuin Airport","MX",22.0382995605,-98.806503295900001]
["TLC","Licenciado Adolfo Lopez Mateos International Airport","MX",19.337099075299999,-99.566001892100005]
["TAP","Tapachula International Airport","MX",14.794300079299999,-92.370002746599994]
["WIX","Tuxpan Airport","MX",19.5839004517,-103.38400268549999]
["CUN","Cancun International Airport","MX",21.036500930799999,-86.877098083500002]
["VSA","Carlos Rovirosa Perez International Airport","MX",17.9969997406,-92.817398071300005]
["VER","General Heriberto Jara International Airport","MX",19.145900726299999,-96.187301635699995]
["ZCL","General Leobardo C. Ruiz International Airport","MX",22.8971004486,-102.68699646]
["ZIH","Ixtapa Zihuatanejo International Airport","MX",17.601600647000001,-101.460998535]
["ZMM","Zamora Airport","MX",20.045000076299999,-102.2760009766]
["ZLO","Playa De Oro International Airport","MX",19.144800186200001,-104.558998108]
["BEF","Bluefields Airport","NI",11.9910001755,-83.774101257300003]
["BZA","San Pedro Airport","NI",13.949999809299999,-84.599998474100005]
["RNI","Corn Island","NI",12.162899971,-83.063796997099999]
["MGA","Augusto C. Sandino (Managua) International Airport","NI",12.141500473000001,-86.168197631799998]
["NVG","Nueva Guinea Airport","NI",11.666666984600001,-84.449996948199995]
["PUZ","Puerto Cabezas Airport","NI",14.047200202899999,-83.386703491199995]
["RFS","Rosita Airport","NI",13.8896999359,-84.408897399899999]
["NCR","San Carlos","NI",11.1333999634,-84.769996643100001]
["SIU","Siuna","NI",13.7272224426,-84.777778625500005]
["WSP","Waspam Airport","NI",14.739199638400001,-83.969398498499999]
["BOC","Bocas Del Toro International Airport","PA",9.3408498764000001,-82.250801086400003]
["CTD","Alonso Valderrama Airport","PA",7.9878401755999997,-80.409698486300002]
["CHX","Cap Manuel Nino International Airport","PA",9.4586400986000001,-82.516799926800005]
["DAV","Enrique Malek International Airport","PA",8.3909997940000007,-82.434997558600003]
["ONX","Enrique Adolfo Jimenez Airport","PA",9.3566398620999998,-79.867401122999993]
["BLB","Howard/Panama Pacifico International Airport","PA",8.9147901535000003,-79.599601745599998]
["JQE","Jaque Airport","PA",7.5177798271,-78.157203674300007]
["PLP","Captain Ramon Xatruch Airport","PA",8.4066696167000003,-78.141700744600001]
["PAC","Marcos A. Gelabert International Airport","PA",8.9733400344999996,-79.555603027299995]
["PUE","Puerto Obaldia Airport","PA",8.6862602233999997,-77.524398803699995]
["SYP","Ruben Cantu Airport","PA",8.0855998993,-80.945297241199995]
["RIH","Scarlett Martinez International Airport","PA",8.3758330000000001,-80.127778000000006]
["PTY","Tocumen International Airport","PA",9.0713596344000003,-79.383499145499997]
["PVE","El Porvenir Airport","PA",9.5634202957000003,-79.004096984900002]
["NBL","San Blas Airport","PA",9.4496002197000006,-78.979499816900002]
["FON","Arenal Airport","CR",10.477999687200001,-84.634498596200004]
["TTQ","Aerotortuguero Airport","CR",10.5690002441,-83.514801025400004]
["BAI","Buenos Aires Airport","CR",9.1636104584000009,-83.329902648900003]
["BCL","Barra del Colorado Airport","CR",10.768699646,-83.585601806599996]
["CSC","Mojica Airport","CR",10.4307003021,-85.174598693799993]
["OTR","Coto 47 Airport","CR",8.6015596389999995,-82.968597412099996]
["JAP","Chacarita Airport","CR",9.9814100266000008,-84.772697448700001]
["RIK","Carrillo Airport","CR",9.8705101013000007,-85.4813995361]
["DRK","Drake Bay Airport","CR",8.7188901900999998,-83.641700744600001]
["FMG","Flamingo Airport","CR",10.418600082399999,-85.782699585000003]
["GLF","Golfito Airport","CR",8.6540098190000005,-83.1821975708]
["GPL","Guapiles Airport","CR",10.2172002792,-83.796997070299994]
["PBP","Islita Airport","CR",9.8561096190999997,-85.370796203599994]
["LIR","Daniel Oduber Quiros International Airport","CR",10.593299865700001,-85.544403076199998]
["LSL","Los Chiles Airport","CR",11.035300254799999,-84.7061004639]
["LIO","Limon International Airport","CR",9.9579601287999999,-83.022003173800002]
["NCT","Guanacaste Airport","CR",10.1393995285,-85.445800781299994]
["NOB","Nosara Airport","CR",9.9764900208,-85.652999877900001]
["SJO","Juan Santamaria International Airport","CR",9.9938602448000005,-84.2088012695]
["PJM","Puerto Jimenez Airport","CR",8.5333299637,-83.300003051800005]
["PMZ","Palmar Sur Airport","CR",8.9510297775000005,-83.468597412099996]
["SYQ","Tobias Bolanos International Airport","CR",9.9570503235000007,-84.139801025400004]
["XQP","Quepos Managua Airport","CR",9.4431600571000001,-84.129798889200003]
["RFR","Rio Frio / Progreso Airport","CR",10.3274002075,-83.887603759800001]
["IPZ","San Isidro del General Airport","CR",9.3526201247999996,-83.713096618700007]
["PLD","Playa Samara Airport","CR",10.25,-85.416999816900002]
["TOO","San Vito De Java Airport","CR",8.8261098861999994,-82.958900451700003]
["TNO","Tamarindo De Santa Cruz Airport","CR",10.313500404399999,-85.815498352099993]
["TMU","Tambor Airport","CR",9.7385196686000004,-85.013801574699997]
["UPL","Upala Airport","CR",10.892200470000001,-85.016197204600005]
["SAL","El Salvador International Airport","SV",13.440899848899999,-89.055702209499998]
["ILS","Ilopango International Airport","SV",13.6995000839,-89.119903564500007]
["CYA","Les Cayes Airport","HT",18.2710990906,-73.788299560499993]
["CAP","Cap Haitien International Airport","HT",19.732999801599998,-72.194702148399998]
["JAK","Jacmel Airport","HT",18.241100311299999,-72.518501281699997]
["JEE","Jeremie Airport","HT",18.6630992889,-74.170303344700002]
["PAP","Toussaint Louverture International Airport","HT",18.579999923700001,-72.292503356899999]
["PAX","Port-de-Paix Airport","HT",19.933599472000001,-72.848602294900004]
["BCA","Gustavo Rizo Airport","CU",20.365299224899999,-74.506202697800006]
["BWW","Las Brujas Airport","CU",22.6212997437,-79.147201538100006]
["BYM","Carlos Manuel de Cespedes Airport","CU",20.3964004517,-76.621398925799994]
["AVI","Maximo Gomez Airport","CU",22.0270996094,-78.789596557600007]
["CCC","Jardines Del Rey Airport","CU",22.461000442500001,-78.328399658199999]
["CFG","Jaime Gonzalez Airport","CU",22.149999618500001,-80.414199829099999]
["CYO","Vilo Acuna International Airport","CU",21.6165008545,-81.545997619600001]
["CMW","Ignacio Agramonte International Airport","CU",21.420299530000001,-77.847503662099996]
["QCO","Colon Airport","CU",22.711099624599999,-80.922798156699997]
["SCU","Antonio Maceo International Airport","CU",19.969800949100001,-75.835403442399993]
["NBW","Leeward Point Field","CU",19.906499862699999,-75.207099914599993]
["GAO","Mariana Grajales Airport","CU",20.085300445600001,-75.158302307100001]
["HAV","Jose Marti International Airport","CU",22.989200592,-82.409103393600006]
["HOG","Frank Pais International Airport","CU",20.7856006622,-76.315101623499999]
["VRO","Kawama Airport","CU",23.1240005493,-81.301597595199993]
["LCL","La Coloma Airport","CU",22.336099624599999,-83.641899108900006]
["UMA","Punta de Maisi Airport","CU",20.250600814799999,-74.150497436500004]
["MJG","Mayajigua Airport","CU",22.230800628699999,-79.062202453599994]
["MOA","Orestes Acosta Airport","CU",20.6539001465,-74.922203064000001]
["MZO","Sierra Maestra Airport","CU",20.2880992889,-77.089202880900004]
["QSN","San Nicolas De Bari Airport","CU",22.756099700899998,-81.9208984375]
["ICR","Nicaro Airport","CU",20.6886005402,-75.531501770000006]
["GER","Rafael Cabrera Airport","CU",21.834699630700001,-82.783798217799998]
["UPB","Playa Baracoa Airport","CU",23.032800674400001,-82.579399108900006]
["QPD","Pinar Del Rio Airport","CU",22.421400070200001,-83.678398132300003]
["SNU","Abel Santamaria Airport","CU",22.4922008514,-79.943603515600003]
["SNJ","San Julian Air Base","CU",22.095300674400001,-84.152000427199994]
["SZJ","Siguanea Airport","CU",21.642499923700001,-82.955101013199993]
["USS","Sancti Spiritus Airport","CU",21.9703998566,-79.442703247099999]
["TND","Alberto Delgado Airport","CU",21.7882995605,-79.997200012199997]
["VRA","Juan Gualberto Gomez International Airport","CU",23.034400939899999,-81.435302734399997]
["VTU","Hermanos Ameijeiras Airport","CU",20.987600326500001,-76.935798645000006]
["CYB","Gerrard Smith International Airport","KY",19.687000274700001,-79.882797241199995]
["LYB","Edward Bodden Airfield","KY",19.666999816899999,-80.099998474100005]
["GCM","Owen Roberts International Airport","KY",19.292800903300002,-81.357696533199999]
["MAY","Clarence A. Bain Airport","BS",24.2877006531,-77.684600830099996]
["ASD","Andros Town Airport","BS",24.697900772099999,-77.795600891099994]
["COX","Congo Town Airport","BS",24.158700942999999,-77.5897979736]
["MHH","Marsh Harbour International Airport","BS",26.511400222799999,-77.083503723099994]
["SAQ","San Andros Airport","BS",25.053800582899999,-78.049003601099997]
["AXP","Spring Point Airport","BS",22.441799163799999,-73.970901489300005]
["TCB","Treasure Cay Airport","BS",26.745300293,-77.391296386700006]
["WKR","Abaco I Walker C Airport","BS",27.266700744600001,-78.399696350100001]
["CCZ","Chub Cay Airport","BS",25.417100906400002,-77.880897521999998]
["GHC","Great Harbour Cay Airport","BS",25.738300323499999,-77.840103149399994]
["BIM","South Bimini Airport","BS",25.699899673499999,-79.264701843300003]
["ATC","Arthur's Town Airport","BS",24.629400253299998,-75.673797607400004]
["CXY","Cat Cay Airport","BS",25.600000381499999,-79.266998290999993]
["CRI","Colonel Hill Airport","BS",22.745599746700002,-74.182403564500007]
["PWN","Pitts Town Airport","BS",22.829700469999999,-74.346099853499993]
["GGT","Exuma International Airport","BS",23.562599182100001,-75.877998352099993]
["ELH","North Eleuthera Airport","BS",25.474899292,-76.683502197300001]
["GHB","Governor's Harbour Airport","BS",25.2847003937,-76.331001281699997]
["NMC","Normans Cay Airport","BS",24.594299316400001,-76.820198059099994]
["RSD","Rock Sound Airport","BS",24.8950787333,-76.1768817902]
["TYM","Staniel Cay Airport","BS",24.1690998077,-76.439102172899993]
["FPO","Grand Bahama International Airport","BS",26.5587005615,-78.695602417000003]
["GBI","Gulbarga Kalaburagi Airport","IN",17.307777999999999,76.958055999999999]
["WTD","West End Airport","BS",26.685300826999999,-78.974998474100005]
["IGA","Inagua Airport","BS",20.975000381499999,-73.666900634800001]
["LGI","Deadman's Cay Airport","BS",23.1790008545,-75.093597412099996]
["SML","Stella Maris Airport","BS",23.5823168043,-75.268621444700003]
["MYG","Mayaguana Airport","BS",22.3794994354,-73.013496398900003]
["NAS","Lynden Pindling International Airport","BS",25.038999557499999,-77.466201782200002]
["PID","Nassau Paradise Island Airport","BS",25.083000183100001,-77.300003051800005]
["DCT","Duncan Town Airport","BS",22.181800842299999,-75.729499816900002]
["RCY","Rum Cay Airport","BS",23.684400558499998,-74.836196899399994]
["ZSA","San Salvador Airport","BS",24.063299179099999,-74.524002075200002]
["BZE","Philip S. W. Goldson International Airport","BZ",17.539100647000001,-88.308197021500007]
["AIT","Aitutaki Airport","CK",-18.8309001923,-159.76400756839999]
["AIU","Enua Airport","CK",-19.967800140400001,-158.1190032959]
["MGS","Mangaia Island Airport","CK",-21.895986557000001,-157.9066619873]
["MHX","Manihiki Island Airport","CK",-10.376700401300001,-161.00199890139999]
["MUK","Mauke Airport","CK",-20.136100768999999,-157.3450012207]
["MOI","Mitiaro Island Airport","CK",-19.842500686600001,-157.70300292970001]
["PYE","Tongareva Airport","CK",-9.0143699646000002,-158.03240966800001]
["RAR","Rarotonga International Airport","CK",-21.202699661299999,-159.80599975589999]
["ICI","Cicia Airport","FJ",-17.7432994843,-179.341995239]
["NAN","Nadi International Airport","FJ",-17.755399703999998,177.44299316409999]
["PTF","Malolo Lailai Island Airport","FJ",-17.7779006958,177.19700622600001]
["KDV","Vunisea Airport","FJ",-19.058099746700002,178.15699768100001]
["MNF","Mana Island Airport","FJ",-17.673099517800001,177.09800720199999]
["MFJ","Moala Airport","FJ",-18.566699981700001,179.951004028]
["SUV","Nausori International Airport","FJ",-18.043300628699999,178.5590057373]
["LEV","Levuka Airfield","FJ",-17.711099624599999,178.759002686]
["NGI","Ngau Airport","FJ",-18.115600585900001,179.33999633799999]
["LUC","Laucala Island Airport","FJ",-16.748100280799999,-179.6670074463]
["LKB","Lakeba Island Airport","FJ",-18.199199676500001,-178.81700134299999]
["LBS","Labasa Airport","FJ",-16.466699600199998,179.3399963379]
["TVU","Matei Airport","FJ",-16.690599441500002,-179.87699890100001]
["KXF","Koro Island Airport","FJ",-17.345800399800002,179.42199707]
["RTA","Rotuma Airport","FJ",-12.482500076299999,177.0709991455]
["SVU","Savusavu Airport","FJ",-16.802799224899999,179.34100341800001]
["VAU","Vatukoula Airport","FJ",-17.5,177.84199523929999]
["KAY","Wakaya Island Airport","FJ",-17.617000579799999,179.01699829099999]
["ONU","Ono-I-Lau Airport","FJ",-20.649999618500001,-178.69999694820001]
["YAS","Yasawa Island Airport","FJ",-16.758899688700001,177.54499816890001]
["EUA","Kaufana Airport","TO",-21.378299713099999,-174.95799255399999]
["TBU","Fua'amotu International Airport","TO",-21.2411994934,-175.14999389650001]
["HPA","Lifuka Island Airport","TO",-19.777000427200001,-174.34100341800001]
["Niu","Mata'aho Airport","TO",-15.5707998276,-175.63299560499999]
["NTT","Kuini Lavenia Airport","TO",-15.977337651899999,-173.79102945299999]
["VAV","Vava'u International Airport","TO",-18.585300445600001,-173.96200561520001]
["VBV","Vanua Balavu Airport","FJ",-17.2689990997,-178.9759979248]
["VTF","Vatulele Airport","FJ",-18.5125007629,177.63900756839999]
["ABF","Abaiang Airport","KI",1.7986099719999999,173.0410003662]
["BEZ","Beru Airport","KI",-1.3547199965000001,176.00700378420001]
["FUN","Funafuti International Airport","TV",-8.5250000000000004,179.195999]
["KUC","Kuria Airport","KI",0.218611002,173.44200134280001]
["MNK","Maiana Airport","KI",1.0036100149,173.03100585940001]
["MZK","Marakei Airport","KI",2.0586099624999998,173.27099609379999]
["MTK","Makin Island Airport","KI",3.3744399548000001,172.99200439449999]
["NIG","Nikunau Airport","KI",-1.3144400119999999,176.41000366200001]
["OOT","Onotoa Airport","KI",-1.796110034,175.52600097659999]
["TRW","Bonriki International Airport","KI",1.3816399574,173.14700317379999]
["AEA","Abemama Atoll Airport","KI",0.49083301419999997,173.82899475100001]
["TBF","Tabiteuea North Airport","KI",-1.2244700193,174.77600097659999]
["TMN","Tamana Island Airport","KI",-2.4858300685999999,175.9700012207]
["NON","Nonouti Airport","KI",-0.63972198960000004,174.42799377439999]
["AIS","Arorae Island Airport","KI",-2.6161100864,176.80299377439999]
["TSU","Tabiteuea South Airport","KI",-1.4744399786,175.06399536129999]
["BBG","Butaritari Atoll Airport","KI",3.0858299732000001,172.81100463870001]
["AAK","Buariki Airport","KI",0.1852779984,173.6369934082]
["IUE","Niue International Airport","NU",-19.0790309906,-169.92559814449999]
["FUT","Pointe Vele Airport","WF",-14.311400413499999,-178.06599426299999]
["WLS","Hihifo Airport","WF",-13.238300323500001,-176.19900512699999]
["OFU","Ofu Village Airport","AS",-14.184399604799999,-169.66999816890001]
["AAU","Asau Airport","WS",-13.5058002472,-172.628005981]
["APW","Faleolo International Airport","WS",-13.829999923700001,-172.00799560550001]
["FGI","Fagali'i Airport","WS",-13.848699569700001,-171.74000549300001]
["FTI","Fitiuta Airport","AS",-14.2172002792,-169.42500305199999]
["MXS","Maota Airport","WS",-13.742300033599999,-172.25799560550001]
["PPG","Pago Pago International Airport","AS",-14.3310003281,-170.710006714]
["PPT","Faa'a International Airport","PF",-17.5536994934,-149.60699462900001]
["RUR","Rurutu Airport","PF",-22.434099197399998,-151.36099243160001]
["TUB","Tubuai Airport","PF",-23.3654003143,-149.5240020752]
["RVV","Raivavae Airport","PF",-23.885200500500002,-147.66200256299999]
["AAA","Anaa Airport","PF",-17.352600097700002,-145.50999450680001]
["FGU","Fangatau Airport","PF",-15.819899559,-140.8869934082]
["TIH","Tikehau Airport","PF",-15.119600296,-148.23100280759999]
["APK","Apataki Airport","PF",-15.5735998154,-146.41499328610001]
["REA","Reao Airport","PF",-18.465900421099999,-136.4400024414]
["FAV","Fakarava Airport","PF",-16.054100036600001,-145.65699768069999]
["HHZ","Hikueru Atoll Airport","PF",-17.544700622600001,-142.61399841310001]
["XMH","Manihi Airport","PF",-14.4368000031,-146.07000732419999]
["GMR","Totegegie Airport","PF",-23.079900741599999,-134.88999938960001]
["KKR","Kaukura Airport","PF",-15.6632995605,-146.88499450680001]
["MKP","Makemo Airport","PF",-16.5839004517,-143.65800476070001]
["NAU","Napuka Island Airport","PF",-14.176799774199999,-141.26699829099999]
["TKV","Tatakoto Airport","PF",-17.355300903300002,-138.44500732419999]
["PKP","Puka Puka Airport","PF",-14.8094997406,-138.81300354000001]
["PUK","Pukarua Airport","PF",-18.295600891100001,-137.01699829099999]
["TKP","Takapoto Airport","PF",-14.709500312799999,-145.24600219729999]
["AXR","Arutua Airport","PF",-15.248299598699999,-146.61700439449999]
["MVT","Mataiva Airport","PF",-14.8681001663,-148.71699523929999]
["NUK","Nukutavake Airport","PF",-19.284999847400002,-138.77200317379999]
["ZTA","Tureia Airport","PF",-20.789699554399999,-138.57000732419999]
["AHE","Ahe Airport","PF",-14.4280996323,-146.25700378420001]
["KHZ","Kauehi Airport","PF",-15.780799865700001,-145.12399291989999]
["FAC","Faaite Airport","PF",-16.686700820900001,-145.32899475100001]
["FHZ","Fakahina Airport","PF",-15.992199897800001,-140.16499328610001]
["RKA","Aratika Nord Airport","PF",-15.4853000641,-145.47000122099999]
["TJN","Takume Airport","PF",-15.8547000885,-142.2680053711]
["RRR","Raroia Airport","PF",-16.045000000000002,-142.476944]
["TKX","Takaroa Airport","PF",-14.455800056499999,-145.02499389650001]
["KXU","Katiu Airport","PF",-16.3393993378,-144.40299987789999]
["NHV","Nuku Hiva Airport","PF",-8.7955999374000005,-140.22900390629999]
["AUQ","Hiva Oa-Atuona Airport","PF",-9.7687902450999999,-139.01100158689999]
["UAP","Ua Pou Airport","PF",-9.3516702651999992,-140.07800292970001]
["UAH","Ua Huka Airport","PF",-8.9361095428000006,-139.55200195309999]
["BOB","Bora Bora Airport","PF",-16.444400787399999,-151.75100708010001]
["TTI","Tetiaroa Airport","PF",-17.013299942,-149.58700561520001]
["RGI","Rangiroa Airport","PF",-14.954299926799999,-147.6609954834]
["HUH","Huahine-Fare Airport","PF",-16.687200546300001,-151.02200317379999]
["MOZ","Moorea Airport","PF",-17.489999771099999,-149.7619934082]
["HOI","Hao Airport","PF",-18.0748004913,-140.9459991455]
["MAU","Maupiti Airport","PF",-16.426500320399999,-152.2440032959]
["RFP","Raiatea Airport","PF",-16.7229003906,-151.46600341800001]
["UOA","Mururoa Atoll Airport","PF",-21.867000579799999,-138.9170074463]
["VHZ","Vahitahi Airport","PF",-18.780000686600001,-138.85299682620001]
["MTV","Mota Lava Airport","VU",-13.6660003662,167.71200561520001]
["SLH","Sola Airport","VU",-13.851699829099999,167.53700256350001]
["TOH","Torres Airstrip","VU",-13.3280000687,166.63800048830001]
["EAE","Sangafa Airport","VU",-17.0902996063,168.34300231930001]
["CCV","Craig Cove Airport","VU",-16.2649993896,167.92399597170001]
["LOD","Longana Airport","VU",-15.3066997528,167.96699523929999]
["SSR","Sara Airport","VU",-15.4708003998,168.15199279789999]
["PBJ","Tavie Airport","VU",-16.438999175999999,168.25700378420001]
["LPM","Lamap Airport","VU",-16.454000473000001,167.82299804690001]
["LNB","Lamen Bay Airport","VU",-16.584199905399998,168.15899658199999]
["MWF","Naone Airport","VU",-15,168.0829925537]
["LNE","Lonorore Airport","VU",-15.8655996323,168.17199707029999]
["NUS","Norsup Airport","VU",-16.079700469999999,167.40100097659999]
["ZGU","Gaua Island Airport","VU",-14.2180995941,167.58700561500001]
["RCL","Redcliffe Airport","VU",-15.472000122100001,167.83500671389999]
["SON","Santo Pekoa International Airport","VU",-15.5050001144,167.22000122099999]
["TGH","Tongoa Island Airport","VU",-16.891099929799999,168.55099487300001]
["ULB","Ulei Airport","VU",-16.329699999999999,168.30109999999999]
["VLS","Valesdir Airport","VU",-16.796100616499999,168.17700195309999]
["WLH","Walaha Airport","VU",-15.411999702499999,167.6909942627]
["SWJ","Southwest Bay Airport","VU",-16.4864,167.44720000000001]
["OLJ","North West Santo Airport","VU",-14.8816995621,166.55799865700001]
["AUY","Anelghowhat Airport","VU",-20.249200820900001,169.77099609379999]
["AWD","Aniwa Airport","VU",-19.239999771099999,169.60499572750001]
["DLY","Dillon's Bay Airport","VU",-18.769399642900002,169.00100708010001]
["FTA","Futuna Airport","VU",-19.516399383500001,170.23199462900001]
["IPA","Ipota Airport","VU",-18.856389,169.283333]
["UIQ","Quion Hill Airport","VU",-17.540000915499999,168.44200134280001]
["VLI","Port Vila Bauerfield Airport","VU",-17.699300766,168.32000732419999]
["TAH","Tanna Airport","VU",-19.455099105799999,169.22399902340001]
["TGJ","Tiga Airport","NC",-21.0960998535,167.8040008545]
["BMY","Ile Art - Waala Airport","NC",-19.720600128200001,163.6609954834]
["KNQ","Kone Airport","NC",-21.054300308199998,164.83700561520001]
["ILP","Ile des Pins Airport","NC",-22.588899612399999,167.45599365230001]
["HLU","Nesson Airport","NC",-21.256399154699999,165.61700439449999]
["KOC","Koumac Airport","NC",-20.546300888099999,164.2559967041]
["LIF","Lifou Airport","NC",-20.7747993469,167.24000549319999]
["GEA","Noumea Magenta Airport","NC",-22.258300781300001,166.47300720210001]
["IOU","Edmond Cane Airport","NC",-22.459999084500001,166.78300476070001]
["PUV","Poum Airport","NC",-20.289199829099999,164.09899902340001]
["PDC","Mueo Airport","NC",-21.316400527999999,164.99899291989999]
["MEE","Mare Airport","NC",-21.4817008972,168.03799438479999]
["TOU","Touho Airport","NC",-20.790000915499999,165.25900268550001]
["UVE","Ouvea Airport","NC",-20.6406002045,166.57299804690001]
["NOU","La Tontouta International Airport","NC",-22.0146007538,166.21299743649999]
["AKL","Auckland International Airport","NZ",-37.008098602300002,174.7920074463]
["TUO","Taupo Airport","NZ",-38.739700317400001,176.0839996338]
["AMZ","Ardmore Airport","NZ",-37.029701232900003,174.97300720210001]
["ASG","Ashburton Aerodrome","NZ",-43.903301239000001,171.79699707029999]
["CHC","Christchurch International Airport","NZ",-43.489398956300001,172.53199768069999]
["CHT","Chatham Islands-Tuuta Airport","NZ",-43.810001373299997,-176.45700073239999]
["CMV","Coromandel Aerodrome","NZ",-36.791698455800002,175.50900268550001]
["DGR","Dargaville Aerodrome","NZ",-35.939701080299997,173.89399719240001]
["DUD","Dunedin Airport","NZ",-45.928100585899998,170.19799804690001]
["WHO","Franz Josef Aerodrome","NZ",-43.3630981445,170.13400268550001]
["GBZ","Great Barrier Aerodrome","NZ",-36.241401672400002,175.47200012210001]
["GMN","Greymouth Airport","NZ",-42.4617004395,171.1900024414]
["GIS","Gisborne Airport","NZ",-38.6632995605,177.97799682620001]
["GTN","Glentanner Airport","NZ",-43.906700134300003,170.12800598140001]
["HKK","Hokitika Airfield","NZ",-42.713600158699997,170.98500061039999]
["HLZ","Hamilton International Airport","NZ",-37.866699218800001,175.33200073200001]
["WIK","Waiheke Reeve Airport","NZ",-36.808898925800001,175.08599853519999]
["KBZ","Kaikoura Airport","NZ",-42.424999237100003,173.60499572750001]
["KKE","Kerikeri Airport","NZ",-35.262798309300003,173.91200256350001]
["KKO","Kaikohe Airport","NZ",-35.4510993958,173.81700134280001]
["KAT","Kaitaia Airport","NZ",-35.069999694800003,173.2850036621]
["ALR","Alexandra Airport","NZ",-45.2117004395,169.37300109860001]
["MTA","Matamata Glider Airport","NZ",-37.734401702900001,175.74200439449999]
["MON","Mount Cook Airport","NZ",-43.7649993896,170.13299560550001]
["MFN","Milford Sound Airport","NZ",-44.673301696800003,167.9230041504]
["MZP","Motueka Airport","NZ",-41.123298644999998,172.98899841310001]
["TEU","Manapouri Airport","NZ",-45.533100128199997,167.64999389650001]
["MRO","Hood Airport","NZ",-40.973300933799997,175.63400268550001]
["NPL","New Plymouth Airport","NZ",-39.008598327599998,174.1790008545]
["NPE","Napier Airport","NZ",-39.465801239000001,176.86999511720001]
["NSN","Nelson Airport","NZ",-41.298301696800003,173.220993042]
["IVC","Invercargill Airport","NZ",-46.412399292000003,168.31300354000001]
["OHA","RNZAF Base Ohakea","NZ",-40.206001281699997,175.38800048830001]
["OAM","Oamaru Airport","NZ",-44.970001220699999,171.08200073239999]
["PMR","Palmerston North Airport","NZ",-40.320598602300002,175.61700439449999]
["PCN","Picton Aerodrome","NZ",-41.3460998535,173.95599365230001]
["PPQ","Paraparaumu Airport","NZ",-40.904701232900003,174.98899841310001]
["ZQN","Queenstown International Airport","NZ",-45.021099090600003,168.73899841299999]
["RAG","Raglan Airfield","NZ",-37.804698944099997,174.86000061039999]
["SZS","Ryans Creek Aerodrome","NZ",-46.899700164800002,168.100997925]
["ROT","Rotorua Regional Airport","NZ",-38.109199523900003,176.31700134280001]
["TRG","Tauranga Airport","NZ",-37.671901702900001,176.1959991455]
["TMZ","Thames Aerodrome","NZ",-37.156700134300003,175.55000305179999]
["KTF","Takaka Airport","NZ",-40.813301086400003,172.77499389650001]
["TKZ","Tokoroa Airfield","NZ",-38.236698150599999,175.89199829099999]
["THH","Taharoa Aerodrome","NZ",-38.181098937999998,174.7079925537]
["TIU","Timaru Airport","NZ",-44.302799224899999,171.22500610349999]
["TWZ","Pukaki Airport","NZ",-44.2350006104,170.11799621599999]
["BHE","Woodbourne Airport","NZ",-41.5182991028,173.86999511720001]
["WKA","Wanaka Airport","NZ",-44.722198486300002,169.24600219729999]
["WHK","Whakatane Airport","NZ",-37.920600891100001,176.91400146480001]
["WLG","Wellington International Airport","NZ",-41.327201843300003,174.80499267600001]
["WIR","Wairoa Airport","NZ",-39.006900787399999,177.40699768069999]
["WRE","Whangarei Airport","NZ",-35.7682991028,174.36500549319999]
["WSZ","Westport Airport","NZ",-41.7380981445,171.58099365230001]
["WTZ","Whitianga Airport","NZ",-36.831699371299997,175.6790008545]
["WAG","Wanganui Airport","NZ",-39.962200164800002,175.02499389650001]
["BIN","Bamiyan Airport","AF",34.817001342799998,67.817001342799998]
["BST","Bost Airport","AF",31.5597000122,64.364997863799999]
["CCN","Chakcharan Airport","AF",34.533000946000001,65.266998290999993]
["DAZ","Darwaz Airport","AF",38.461101532000001,70.882499694800003]
["FAH","Farah Airport","AF",32.367000579799999,62.182998657200002]
["FBD","Faizabad Airport","AF",37.121101379400002,70.518096923800002]
["KWH","Khwahan Airport","AF",37.882999420200001,70.217002868700007]
["HEA","Herat Airport","AF",34.209999084499998,62.228298187299998]
["OAI","Bagram Air Base","AF",34.946098327599998,69.264999389600007]
["JAA","Jalalabad Airport","AF",34.399799346899997,70.498596191399997]
["KBL","Kabul International Airport","AF",34.565898895300002,69.212303161600005]
["KDH","Kandahar Airport","AF",31.5058002472,65.847801208500002]
["KHT","Khost Airport","AF",33.333400726299999,69.952003478999998]
["MMZ","Maimana Airport","AF",35.930801391599999,64.760902404800007]
["MZR","Mazar I Sharif Airport","AF",36.706901550300003,67.209701538100006]
["LQN","Qala-I-Naw Airport","AF",34.9850006104,63.117801666299997]
["OAS","Sharana Airstrip","AF",33.125749999999996,68.838516999999996]
["OAH","Shindand Airport","AF",33.3913002014,62.261001586900001]
["SGA","Sheghnan Airport","AF",37.567001342799998,71.5]
["TII","Tarin Kowt Airport","AF",32.604198455800002,65.865798950200002]
["TQN","Talolqan Airport","AF",36.770698547400002,69.531997680700002]
["UND","Konduz Airport","AF",36.665100097699998,68.910797119099996]
["OAZ","Camp Bastion Airport","AF",31.863800048800002,64.224601745599998]
["ZAJ","Zaranj Airport","AF",30.972221999999999,61.865833000000002]
["BAH","Bahrain International Airport","BH",26.2707996368,50.633598327599998]
["AHB","Abha Regional Airport","SA",18.2404003143,42.6566009521]
["HOF","Al Ahsa Airport","SA",25.2852993011,49.485198974600003]
["ULH","Prince Abdul Majeed bin Abdulaziz International Airport","SA",26.483332999999998,38.116943999999997]
["ABT","Al Baha Airport","SA",20.296100616499999,41.634300231899999]
["BHH","Bisha Airport","SA",19.9843997955,42.620899200399997]
["DMM","King Fahd International Airport","SA",26.471200942999999,49.797901153600002]
["DHA","King Abdulaziz Air Base","SA",26.265399932899999,50.152000427200001]
["DWD","Dawadmi Domestic Airport","SA",24.5,44.400001525900002]
["GIZ","Jizan Regional Airport","SA",16.9011001587,42.585800170900001]
["ELQ","Gassim Airport","SA",26.302799224899999,43.774398803700002]
["URY","Guriat Domestic Airport","SA",31.411899566700001,37.279499053999999]
["HAS","Hail Airport","SA",27.437900543200001,41.686298370400003]
["QJB","Jubail Airport","SA",27.038999557499999,49.405101776099997]
["JED","King Abdulaziz International Airport","SA",21.679599761999999,39.156501769999998]
["HBT","King Khaled Military City Airport","SA",27.9008998871,45.528198242199998]
["KMX","King Khaled Air Base","SA",18.297300338700001,42.803501129200001]
["MED","Prince Mohammad Bin Abdulaziz Airport","SA",24.553400039700001,39.7051010132]
["EAM","Nejran Airport","SA",17.6114006042,44.4192008972]
["AQI","Hafr Al Batin Airport","SA",28.335199356099999,46.125099182100001]
["AKH","Prince Sultan Air Base","SA",24.062700271600001,47.580501556400002]
["RAH","Rafha Domestic Airport","SA",29.626399993900002,43.490600585899998]
["RUH","King Khaled International Airport","SA",24.9575996399,46.6987991333]
["RAE","Arar Domestic Airport","SA",30.9066009521,41.138198852499997]
["RSI","Red Sea International Airport","SA",25.628067114969099,37.088822323268602]
["XXN","Riyadh Air Base","SA",24.709800720200001,46.725200653100003]
["SHW","Sharurah Airport","SA",17.466899871799999,47.121398925800001]
["AJF","Al-Jawf Domestic Airport","SA",29.785100936900001,40.099998474099998]
["SLF","Sulayel Airport","SA",20.4647006989,45.619598388699998]
["TUU","Tabuk Airport","SA",28.3654003143,36.618900299099998]
["TIF","Taif Airport","SA",21.4834003448,40.544300079300001]
["TUI","Turaif Domestic Airport","SA",31.692699432400001,38.731201171899997]
["WAE","Wadi Al Dawasir Airport","SA",20.504299163799999,45.199600219700002]
["EJH","Al Wajh Domestic Airport","SA",26.198600768999999,36.476398467999999]
["YNB","Yenbo Airport","SA",24.144199371300001,38.063400268599999]
["ZUL","Zilfi Airport","SA",26.350000381499999,44.833000183099998]
["ABD","Abadan Airport","IR",30.371099472000001,48.228298187299998]
["DEF","Dezful Airport","IR",32.434398651099997,48.397598266599999]
["AKW","Klawock Airport","US",55.579200744600001,-133.07600402829999]
["GCH","Gachsaran Airport","IR",30.337600708,50.827999114999997]
["QMJ","Shahid Asyaee Airport","IR",32.002399444600002,49.270401001000003]
["OMI","Omidiyeh Airport","IR",30.835199356099999,49.5349006653]
["MRX","Mahshahr Airport","IR",30.556200027500001,49.151901245099999]
["AWZ","Ahwaz Airport","IR",31.337400436399999,48.762001037600001]
["AEU","Abumusa Island Airport","IR",25.8756999969,55.033000946000001]
["BUZ","Bushehr Airport","IR",28.944799423199999,50.834598541299997]
["IAQ","Bastak Airport","IR",27.212699890100001,54.318599700900002]
["AOY","Asaloyeh Airport","IR",27.4813995361,52.615501403800003]
["KNR","Jam Airport","IR",27.820499420200001,52.352199554400002]
["KIH","Kish International Airport","IR",26.526199340800002,53.980201721199997]
["BDH","Bandar Lengeh Airport","IR",26.531999588000001,54.824798584]
["YEH","Persian Gulf International Airport","IR",27.379600524899999,52.737701416]
["KHK","Khark Island Airport","IR",29.260299682599999,50.323898315400001]
["SXI","Sirri Island Airport","IR",25.9088993073,54.539398193399997]
["LVP","Lavan Island Airport","IR",26.810300826999999,53.356300353999998]
["KSH","Shahid Ashrafi Esfahani Airport","IR",34.345901489299997,47.158100128199997]
["IIL","Ilam Airport","IR",33.586601257300003,46.404800414999997]
["KHD","Khoram Abad Airport","IR",33.435398101799997,48.2829017639]
["SDG","Sanandaj Airport","IR",35.245899200399997,47.009201049799998]
["IFH","Hesa Airport","IR",32.928901672400002,51.561100006099998]
["KKS","Kashan Airport","IR",33.8953018188,51.576999664299997]
["IFN","Esfahan Shahid Beheshti International Airport","IR",32.750801086400003,51.861301422099999]
["CQD","Shahrekord Airport","IR",32.2971992493,50.842201232900003]
["RAS","Sardar-e-Jangal Airport","IR",37.323332999999998,49.617778000000001]
["HDM","Hamadan Airport","IR",34.869201660199998,48.552501678500001]
["AJK","Arak Airport","IR",34.138099670400003,49.847301483199999]
["NUJ","Hamadan Air Base","IR",35.211601257300003,48.653400421100002]
["IKA","Imam Khomeini International Airport","IR",35.416099548299997,51.152198791499998]
["THR","Mehrabad International Airport","IR",35.689201355000002,51.313400268599999]
["GZW","Qazvin Airport","IR",36.240100860600002,50.047100067099997]
["PYK","Payam Airport","IR",35.776100158699997,50.826698303199997]
["BND","Bandar Abbas International Airport","IR",27.218299865700001,56.377799987800003]
["JYR","Jiroft Airport","IR",28.7269001007,57.670299530000001]
["KER","Kerman Airport","IR",30.2744007111,56.9510993958]
["BXR","Bam Airport","IR",29.084199905399998,58.450000762899997]
["HDR","Havadarya Airport","IR",27.158300399800002,56.1725006104]
["GSM","Dayrestan Airport","IR",26.754600524899999,55.902400970499997]
["RJN","Rafsanjan Airport","IR",30.297700882000001,56.051101684599999]
["SYJ","Sirjan Airport","IR",29.5508995056,55.672698974600003]
["XBJ","Birjand Airport","IR",32.898101806600003,59.266101837199997]
["CKT","Sarakhs Airport","IR",36.501201629599997,61.064899444600002]
["RUD","Shahroud Airport","IR",36.425300598100002,55.104198455800002]
["MHD","Mashhad International Airport","IR",36.235198974600003,59.6409988403]
["BJB","Bojnord Airport","IR",37.493000030499999,57.308200836200001]
["AFZ","Sabzevar National Airport","IR",36.168098449699997,57.595199585000003]
["TCX","Tabas Airport","IR",33.667800903299998,56.892700195300002]
["BBL","Ballera Airport","AU",-27.408300399800002,141.80799865719999]
["KLM","Kalaleh Airport","IR",37.383300781300001,55.451999664299997]
["GBT","Gorgan Airport","IR",36.909400939900003,54.401298522899999]
["BSM","Bishe Kola Air Base","IR",36.655101776099997,52.349601745599998]
["NSH","Noshahr Airport","IR",36.6632995605,51.464698791499998]
["RZR","Ramsar Airport","IR",36.9099006653,50.679599762000002]
["SRY","Dasht-e Naz Airport","IR",36.635799407999997,53.193599700900002]
["FAZ","Fasa Airport","IR",28.891799926800001,53.723300933799997]
["JAR","Jahrom Airport","IR",28.5867004395,53.5791015625]
["LRR","Lar Airport","IR",27.674699783299999,54.383300781199999]
["LFM","Lamerd Airport","IR",27.3726997375,53.1888008118]
["SYZ","Shiraz Shahid Dastghaib International Airport","IR",29.539199829099999,52.589801788300001]
["YES","Yasouj Airport","IR",30.700500488300001,51.545101165799998]
["KHY","Khoy Airport","IR",38.427501678500001,44.973598480200003]
["ADU","Ardabil Airport","IR",38.325698852499997,48.424400329599997]
["ACP","Sahand Airport","IR",37.347999572799999,46.127899169899997]
["PFQ","Parsabade Moghan Airport","IR",39.603599548299997,47.881500244100003]
["OMH","Urmia Airport","IR",37.668098449699997,45.068698883099998]
["TBZ","Tabriz International Airport","IR",38.133899688699998,46.2350006104]
["IMQ","Makou Airport","IR",39.330001831099999,44.430000305199997]
["JWN","Zanjan Airport","IR",36.773700714100002,48.359401702900001]
["AZD","Shahid Sadooghi Airport","IR",31.9048995972,54.276500701899998]
["ACZ","Zabol Airport","IR",31.098300933800001,61.5438995361]
["ZBR","Konarak Airport","IR",25.4433002472,60.382099151600002]
["ZAH","Zahedan International Airport","IR",29.475700378399999,60.906200408899998]
["IHR","Iran Shahr Airport","IR",27.236099243200002,60.720001220699999]
["AMM","Queen Alia International Airport","JO",31.722600936900001,35.993198394799997]
["ADJ","Amman-Marka International Airport","JO",31.972700118999999,35.991600036599998]
["AQJ","Aqaba King Hussein International Airport","JO",29.611600875899999,35.018100738500003]
["OMF","King Hussein Air College","JO",32.3563995361,36.259201049799998]
["DWN","Downtown Airpark","US",35.449199676500001,-97.533096313499996]
["XIJ","Ahmed Al Jaber Air Base","KW",28.934799194299998,47.791900634800001]
["KWI","Kuwait International Airport","KW",29.226600647000001,47.968898773200003]
["BEY","Beirut Rafic Hariri International Airport","LB",33.820899963400002,35.4883995056]
["KYE","Rene Mouawad Air Base","LB",34.589298248299997,36.0112991333]
["AUH","Abu Dhabi International Airport","AE",24.4330005646,54.651100158699997]
["AZI","Al Bateen Executive Airport","AE",24.428300857499998,54.458099365199999]
["AAN","Al Ain International Airport","AE",24.261699676500001,55.609199523900003]
["DHF","Al Dhafra Air Base","AE",24.248199462900001,54.547698974600003]
["DXB","Dubai International Airport","AE",25.2527999878,55.364398956300001]
["NHD","Al Minhad Air Base","AE",25.0268001556,55.366199493400003]
["DWC","Al Maktoum International Airport","AE",24.8966666667,55.161388888899999]
["FJR","Fujairah International Airport","AE",25.112199783299999,56.324001312299998]
["RKT","Ras Al Khaimah International Airport","AE",25.6135005951,55.9388008118]
["SHJ","Sharjah International Airport","AE",25.328599929799999,55.517200469999999]
["RMB","Buraimi Airport","OM",24.232999801599998,55.783000946000001]
["DQM","Duqm International Airport","OM",19.501899999999999,57.6342]
["FAU","Fahud Airport","OM",22.354759317999999,56.484146118200002]
["RNM","Qarn Alam Airport","OM",21.382999420200001,57.049999237100003]
["KHS","Khasab Air Base","OM",26.170999526999999,56.240600585899998]
["LKW","Lekhwair Airport","OM",22.804984684400001,55.3733682632]
["MSH","Masirah Air Base","OM",20.675399780300001,58.890499114999997]
["MCT","Muscat International Airport","OM",23.593299865700001,58.284400939900003]
["OMM","Marmul Airport","OM",18.135999679600001,55.182098388699998]
["MNH","Hingurakgoda Air Force Base","LK",8.0498104094999992,80.9813995361]
["SLL","Salalah Airport","OM",17.0387001038,54.091300964399998]
["OHS","Sohar Airport","OM",24.464166666699999,56.628333333299999]
["SUH","Sur Airport","OM",22.533000946000001,59.483001709]
["TTH","Thumrait Air Base","OM",17.666000366199999,54.024600982700001]
["AAW","Abbottabad Airport","PK",34.200000762899997,73.25]
["BHW","Bhagatanwala Airport","PK",32.056098937999998,72.948402404800007]
["BNP","Bannu Airport","PK",32.972900390600003,70.5279006958]
["WGB","Bahawalnagar Airport","PK",29.9463005066,73.249099731399994]
["BHV","Bahawalpur Airport","PK",29.3481006622,71.718002319299998]
["CJL","Chitral Airport","PK",35.8866004944,71.8005981445]
["CHB","Chilas Airport","PK",35.426700592000003,74.081703185999999]
["DBA","Dalbandin Airport","PK",28.878299713099999,64.399803161600005]
["DDU","Dadu Airport","PK",26.554500579799999,67.674598693799993]
["DEA","Dera Ghazi Khan Airport","PK",29.961000442500001,70.485900878899997]
["DSK","Dera Ismael Khan Airport","PK",31.909400939899999,70.896598815900006]
["LYP","Faisalabad International Airport","PK",31.364999771099999,72.994796752900001]
["GWD","Gwadar International Airport","PK",25.233299255399999,62.329498291]
["GIL","Gilgit Airport","PK",35.918800353999998,74.333602905299998]
["ISB","Benazir Bhutto International Airport","PK",33.616699218800001,73.099197387700002]
["JAG","Shahbaz Air Base","PK",28.284200668299999,68.449699401900006]
["JIW","Jiwani Airport","PK",25.067800521900001,61.805400848399998]
["KHI","Jinnah International Airport","PK",24.906499862699999,67.160797119099996]
["HDD","Hyderabad Airport","PK",25.318099975599999,68.366096496599994]
["KDD","Khuzdar Airport","PK",27.790599823000001,66.647300720199993]
["KBH","Kalat Airport","PK",29.1333332062,66.516670227099993]
["OHT","Kohat Airport","PK",33.569999694800003,71.440002441399997]
["LHE","Alama Iqbal International Airport","PK",31.521600723300001,74.403602600100001]
["LRG","Loralai Airport","PK",30.355499267599999,68.613502502399996]
["XJM","Mangla Airport","PK",33.050098419199998,73.638397216800001]
["MFG","Muzaffarabad Airport","PK",34.339000701899998,73.508598327599998]
["MWD","Mianwali Air Base","PK",32.563098907499999,71.570701599100005]
["MJD","Moenjodaro Airport","PK",27.335199356099999,68.143096923800002]
["MPD","Sindhri Tharparkar Airport","PK",25.682800293,69.072799682600007]
["MUX","Multan International Airport","PK",30.203199386600001,71.419097900400004]
["WNS","Nawabshah Airport","PK",26.2194004059,68.390098571799996]
["NHS","Nushki Airport","PK",29.538999557499999,66.023300170900001]
["ORW","Ormara Airport","PK",25.274700164799999,64.585998535200005]
["PAJ","Parachinar Airport","PK",33.902099609399997,70.071601867699997]
["PJG","Panjgur Airport","PK",26.954500198400002,64.132499694800003]
["PSI","Pasni Airport","PK",25.290500640899999,63.3451004028]
["PEW","Peshawar International Airport","PK",33.993900299099998,71.5146026611]
["UET","Quetta International Airport","PK",30.251399993900002,66.937797546400006]
["RYK","Shaikh Zaid Airport","PK",28.383899688700001,70.279602050799994]
["RAZ","Rawalakot Airport","PK",33.849700927699999,73.798103332500006]
["SBQ","Sibi Airport","PK",29.571199417100001,67.847900390600003]
["KDU","Skardu Airport","PK",35.335498809800001,75.536003112800003]
["SKZ","Sukkur Airport","PK",27.722000122099999,68.791702270499997]
["SYW","Sehwan Sharif Airport","PK",26.4731006622,67.717201232899995]
["SGI","Mushaf Air Base","PK",32.048599243200002,72.665000915500002]
["SDT","Saidu Sharif Airport","PK",34.813598632800002,72.352798461899994]
["SKT","Sialkot Airport","PK",32.535556793200001,74.363891601600002]
["SUL","Sui Airport","PK",28.6450996399,69.176902771000002]
["SWN","Sahiwal Airport","PK",31.889444351200002,72.391670227099993]
["TLB","Tarbela Dam Airport","PK",33.986099243200002,72.611396789599993]
["BDN","Talhar Airport","PK",24.841499328600001,68.838401794399999]
["TFT","Taftan Airport","PK",28.964199066199999,61.5954017639]
["TUK","Turbat International Airport","PK",25.9864006042,63.0302009583]
["WAF","Wana Airport","PK",32.304698944099997,69.570396423299997]
["PZH","Zhob Airport","PK",31.3584003448,69.463600158700004]
["IQA","Al Asad Air Base","IQ",33.785598754900001,42.4412002563]
["TQD","Al Taqaddum Air Base","IQ",33.338100433299999,43.5970993042]
["BMN","Bamarni Airport","IQ",37.098800659200002,43.2666015625]
["BGW","Baghdad International Airport","IQ",33.262500762899997,44.234600067099997]
["OSB","Mosul International Airport","IQ",36.305801391599999,43.147399902300002]
["EBL","Erbil International Airport","IQ",36.237598419199998,43.963199615500002]
["KIK","Kirkuk Air Base","IQ",35.469501495400003,44.348899841300003]
["BSR","Basrah International Airport","IQ",30.549100875899999,47.662101745599998]
["NJF","Al Najaf International Airport","IQ",31.989722,44.404167000000001]
["RQW","Qayyarah West Airport","IQ",35.767200469999999,43.125099182100001]
["ISU","Sulaymaniyah International Airport","IQ",35.561748504599997,45.316738128700003]
["ALP","Aleppo International Airport","SY",36.180698394799997,37.224399566700001]
["DAM","Damascus International Airport","SY",33.411499023399998,36.515598297099999]
["DEZ","Deir ez-Zor Airport","SY",35.285400390600003,40.175998687700002]
["KAC","Kamishly Airport","SY",37.020599365199999,41.191398620599998]
["LTK","Bassel Al-Assad International Airport","SY",35.401100158699997,35.948699951199998]
["PMS","Palmyra Airport","SY",34.557399749799998,38.3168983459]
["DIA","Doha International Airport","QA",25.261100768999999,51.565101623499999]
["IUD","Al Udeid Air Base","QA",25.117300033599999,51.314998626700003]
["DOH","Hamad International Airport","QA",25.260594600000001,51.613766499999997]
["ADE","Aden International Airport","YE",12.8295001984,45.028800964399998]
["AXK","Ataq Airport","YE",14.5513000488,46.826198577900001]
["BYD","Al-Bayda Airport","YE",13.967000007599999,45.583000183099998]
["BHN","Beihan Airport","YE",14.781999588,45.7201004028]
["AAY","Al Ghaidah International Airport","YE",16.191699981700001,52.174999237100003]
["HOD","Hodeidah International Airport","YE",14.7530002594,42.976299285899998]
["MYN","Mareb Airport","YE",15.469200134299999,45.326900482200003]
["IHN","Qishn Airport","YE",15.416999816900001,51.682998657200002]
["RIY","Mukalla International Airport","YE",14.662599563600001,49.375]
["SYE","Sadah Airport","YE",16.966999053999999,43.733001709]
["SAH","Sana'a International Airport","YE",15.4763002396,44.219699859599999]
["SCT","Socotra International Airport","YE",12.630700111399999,53.905799865699997]
["GXF","Sayun International Airport","YE",15.966099739100001,48.7882995605]
["TAI","Ta'izz International Airport","YE",13.6859998703,44.139099121100003]
["AKB","Atka Airport","US",52.220298769999999,-174.20599369999999]
["PML","Port Moller Airport","US",56.006000518800001,-160.561004639]
["PAQ","Palmer Municipal Airport","US",61.594898223900003,-149.0890045166]
["ATU","Casco Cove Coast Guard Station","US",52.832541659999997,173.17555415999999]
["BTI","Barter Island LRRS Airport","US",70.134002685499993,-143.58200073200001]
["BET","Bethel Airport","US",60.779800420000001,-161.83799740000001]
["BVU","Beluga Airport","US",61.1721992493,-151.04400634800001]
["BIG","Allen Army Airfield","US",63.994499206500002,-145.722000122]
["BKC","Buckland Airport","US",65.981597900400004,-161.149002075]
["BMX","Big Mountain Airport","US",59.361198425300003,-155.259002686]
["BRW","Wiley Post Will Rogers Memorial Airport","US",71.285400390600003,-156.76600646969999]
["BTT","Bettles Airport","US",66.913902280000002,-151.52900700000001]
["CDB","Cold Bay Airport","US",55.2061004639,-162.72500610349999]
["CEM","Central Airport","US",65.573799129999998,-144.78300479999999]
["CHU","Chuathbaluk Airport","US",61.579101559999998,-159.21600340000001]
["CIK","Chalkyitsik Airport","US",66.644996643100001,-143.74000549300001]
["CYF","Chefornak Airport","US",60.1492004395,-164.2859954834]
["SCM","Scammon Bay Airport","US",61.845298767099997,-165.57099914599999]
["IRC","Circle City /New/ Airport","US",65.830497739999998,-144.07600400000001]
["WSF","Cape Sarichef Airport","US",54.582401275599999,-164.91400146480001]
["CDV","Merle K (Mudhole) Smith Airport","US",60.4917984,-145.4779968]
["CXF","Coldfoot Airport","US",67.252197265600003,-150.20399475100001]
["CYT","Yakataga Airport","US",60.082000732399997,-142.49299621579999]
["CZF","Cape Romanzof LRRS Airport","US",61.780300140000001,-166.03900150000001]
["DRG","Deering Airport","US",66.069602966299996,-162.76600647000001]
["RDB","Red Dog Airport","US",68.032096862800003,-162.899002075]
["ADK","Adak Airport","US",51.877998352100001,-176.64599609379999]
["DLG","Dillingham Airport","US",59.04470062,-158.50500489999999]
["MLL","Marshall Don Hunter Sr Airport","US",61.864299774199999,-162.02600097659999]
["ADQ","Kodiak Airport","US",57.75,-152.4940033]
["DUT","Unalaska Airport","US",53.900100707999997,-166.54400634769999]
["KKH","Kongiganak Airport","US",59.960800170900001,-162.8809967041]
["EDF","Elmendorf Air Force Base","US",61.2509994507,-149.80700683590001]
["EEK","Eek Airport","US",60.213672639999999,-162.0438843]
["EAA","Eagle Airport","US",64.776397709999998,-141.15100100000001]
["EHM","Cape Newenham LRRS Airport","US",58.646400451700003,-162.06300354000001]
["EIL","Eielson Air Force Base","US",64.665702820000007,-147.10200499999999]
["EMK","Emmonak Airport","US",62.78609848,-164.4909973]
["ENA","Kenai Municipal Airport","US",60.573101043699999,-151.24499511720001]
["WWT","Newtok Airport","US",60.939098358199999,-164.64100646969999]
["FAI","Fairbanks International Airport","US",64.815101619999993,-147.8560028]
["FBK","Ladd AAF Airfield","US",64.837501529999997,-147.61399840000001]
["AFE","Kake Airport","US",56.961399078399999,-133.9100036621]
["ABL","Ambler Airport","US",67.106300353999998,-157.85699462900001]
["FRN","Bryant Army Heliport","US",61.265900000000002,-149.65330777]
["NIB","Nikolai Airport","US",63.0186004639,-154.35800170900001]
["FMC","Five Mile Airport","US",65.927001953100003,-149.83999633799999]
["FWL","Farewell Airport","US",62.506599426299999,-153.89399719240001]
["GAL","Edward G. Pitka Sr Airport","US",64.736198430000002,-156.93699649999999]
["GBH","Galbraith Lake Airport","US",68.479698181200007,-149.49000549319999]
["KWK","Kwigillingok Airport","US",59.876499176000003,-163.16900634769999]
["SHG","Shungnak Airport","US",66.888099670399995,-157.16200256350001]
["GKN","Gulkana Airport","US",62.1548996,-145.45700070000001]
["GLV","Golovin Airport","US",64.550498962399999,-163.00700378400001]
["GAM","Gambell Airport","US",63.766799926799997,-171.73300170900001]
["GST","Gustavus Airport","US",58.4253006,-135.70700070000001]
["NME","Nightmute Airport","US",60.471000671399999,-164.70100402829999]
["SGY","Skagway Airport","US",59.460098266599999,-135.3159942627]
["GMT","Granite Mountain Air Station","US",65.402099609999993,-161.2810059]
["HCR","Holy Cross Airport","US",62.188301086400003,-159.77499389650001]
["HNE","Tahneta Pass Airport","US",61.901401519799997,-147.30400085400001]
["HSL","Huslia Airport","US",65.697898859999995,-156.35099790000001]
["HNS","Haines Airport","US",59.243801116900002,-135.5240020752]
["HOM","Homer Airport","US",59.645599365199999,-151.47700500490001]
["HPB","Hooper Bay Airport","US",61.52389908,-166.1470032]
["HUS","Hughes Airport","US",66.041099549999998,-154.2630005]
["SHX","Shageluk Airport","US",62.692298889200003,-159.56900024399999]
["IGG","Igiugig Airport","US",59.324001312299998,-155.90199279789999]
["EGX","Egegik Airport","US",58.1855010986,-157.375]
["IAN","Bob Baker Memorial Airport","US",66.975997924799998,-160.43699645999999]
["ILI","Iliamna Airport","US",59.754398350000002,-154.91099550000001]
["UTO","Indian Mountain LRRS Airport","US",65.992797850000002,-153.7039948]
["MCL","Mc Kinley National Park Airport","US",63.732601165799998,-148.91099548299999]
["WAA","Wales Airport","US",65.622596740700004,-168.09500122099999]
["JNU","Juneau International Airport","US",58.354999542199998,-134.57600402829999]
["KGK","Koliganek Airport","US",59.726600646999998,-157.25900268550001]
["KDK","Kodiak Municipal Airport","US",57.805900573700001,-152.37399291989999]
["KFP","False Pass Airport","US",54.8474006653,-163.4100036621]
["AKK","Akhiok Airport","US",56.938701629599997,-154.18299865700001]
["KPN","Kipnuk Airport","US",59.932998657200002,-164.03100585940001]
["KKA","Koyuk Alfred Adams Airport","US",64.9394989014,-161.154006958]
["LKK","Kulik Lake Airport","US",58.982101440400001,-155.12100219729999]
["AKN","King Salmon Airport","US",58.676799770000002,-156.64900209999999]
["IKO","Nikolski Air Station","US",52.941600799600003,-168.84899902340001]
["AKP","Anaktuvuk Pass Airport","US",68.133598329999998,-151.74299619999999]
["KTN","Ketchikan International Airport","US",55.355598450000002,-131.71400449999999]
["UUK","Ugnu-Kuparuk Airport","US",70.330802917499994,-149.59800720199999]
["KAL","Kaltag Airport","US",64.319099429999994,-158.7409973]
["KYK","Karluk Airport","US",57.567100524899999,-154.44999694800001]
["KLN","Larsen Bay Airport","US",57.535099029500003,-153.97799682620001]
["KLG","Kalskag Airport","US",61.536300659200002,-160.34100341800001]
["PTA","Port Alsworth Airport","US",60.204299926799997,-154.31900024399999]
["LNI","Lonely Air Station","US",70.910697940000006,-153.24200440000001]
["DQH","Alpine Airstrip","US",70.344299316399997,-150.94500732399999]
["WCR","Chandalar Lake Airport","US",67.504501342799998,-148.48300170900001]
["LUR","Cape Lisburne LRRS Airport","US",68.875099180000007,-166.11000060000001]
["KMO","Manokotak Airport","US",58.990200042700003,-159.05000305199999]
["MCG","McGrath Airport","US",62.952899930000001,-155.6060028]
["MDO","El Jaguel / Punta del Este Airport","UY",-34.916999816900002,-54.916999816900002]
["LMA","Minchumina Airport","US",63.886001586900001,-152.30200195309999]
["SMK","St Michael Airport","US",63.490100859999998,-162.11000060000001]
["MLY","Manley Hot Springs Airport","US",64.997596740700004,-150.643997192]
["MOU","Mountain Village Airport","US",62.0954017639,-163.68200683590001]
["MRI","Merrill Field","US",61.213500976600002,-149.84399414059999]
["MXY","Mc Carthy Airport","US",61.437099456799999,-142.904006958]
["MYU","Mekoryuk Airport","US",60.371398925800001,-166.27099609379999]
["WNA","Napakiak Airport","US",60.690299987800003,-161.97900390629999]
["ANC","Ted Stevens Anchorage International Airport","US",61.174400329599997,-149.99600219729999]
["ANI","Aniak Airport","US",61.581600189200003,-159.54299926760001]
["ENN","Nenana Municipal Airport","US",64.547302246100003,-149.07400512699999]
["NNL","Nondalton Airport","US",59.980201721199997,-154.8390045166]
["ANN","Annette Island Airport","US",55.042400360099997,-131.57200622560001]
["NUL","Nulato Airport","US",64.729301452599998,-158.07400512699999]
["ANV","Anvik Airport","US",62.646701810000003,-160.1909943]
["KNW","New Stuyahok Airport","US",59.449901580800002,-157.32800293]
["OBU","Kobuk Airport","US",66.912300109900002,-156.89700317399999]
["PCA","Portage Creek Airport","US",58.906501769999998,-157.71400451700001]
["HNH","Hoonah Airport","US",58.0960998535,-135.4100036621]
["OME","Nome Airport","US",64.512199401900006,-165.44500732419999]
["OOK","Toksook Bay Airport","US",60.54140091,-165.0870056]
["ORT","Northway Airport","US",62.9612999,-141.92900090000001]
["OTZ","Ralph Wien Memorial Airport","US",66.884696959999999,-162.59899899999999]
["NLG","Nelson Lagoon Airport","US",56.007499694800003,-161.1600036621]
["PBV","Porto dos Gauchos Airport","BR",-11.5169439316,-57.3338890076]
["KPC","Port Clarence Coast Guard Station","US",65.253700256299993,-166.85899352999999]
["KPV","Perryville Airport","US",55.905998230000002,-159.1629944]
["PSG","Petersburg James A Johnson Airport","US",56.801700590000003,-132.94500729999999]
["PTH","Port Heiden Airport","US",56.959098815899999,-158.63299560550001]
["PKA","Napaskiak Airport","US",60.702899930000001,-161.7779999]
["PTU","Platinum Airport","US",59.011398315400001,-161.82000732419999]
["PIP","Pilot Point Airport","US",57.580398559599999,-157.57200622600001]
["PHO","Point Hope Airport","US",68.348800659199995,-166.79899597170001]
["PPC","Prospect Creek Airport","US",66.814102172899993,-150.64399719240001]
["KWN","Quinhagak Airport","US",59.755100249999998,-161.84500120000001]
["NUI","Nuiqsut Airport","US",70.209999084499998,-151.00599670400001]
["ARC","Arctic Village Airport","US",68.114700317399993,-145.57899475100001]
["RSH","Russian Mission Airport","US",61.778884887700002,-161.31945800779999]
["RBY","Ruby Airport","US",64.727203369999998,-155.47000120000001]
["SVA","Savoonga Airport","US",63.686401367199998,-170.49299621579999]
["SCC","Deadhorse Airport","US",70.194702149999998,-148.4649963]
["SDP","Sand Point Airport","US",55.314998626700003,-160.52299499509999]
["SHH","Shishmaref Airport","US",66.249603271500007,-166.0890045166]
["SIT","Sitka Rocky Gutierrez Airport","US",57.047100067099997,-135.36199951169999]
["WLK","Selawik Airport","US",66.600097660000003,-159.98599239999999]
["KSM","St Mary's Airport","US",62.060501100000003,-163.30200199999999]
["SNP","St Paul Island Airport","US",57.167301178000002,-170.2200012207]
["SOV","Seldovia Airport","US",59.442401885999999,-151.70399475100001]
["SMU","Sheep Mountain Airport","US",61.812000274699997,-147.50700378400001]
["UMM","Summit Airport","US",63.331501007100002,-149.12699890100001]
["SVW","Sparrevohn LRRS Airport","US",61.097400669999999,-155.57400509999999]
["SKW","Skwentna Airport","US",61.965301513699998,-151.1909942627]
["SXQ","Soldotna Airport","US",60.475700378399999,-151.03399658199999]
["SYA","Eareckson Air Station","US",52.712299350000002,174.11399840000001]
["TAL","Ralph M Calhoun Memorial Airport","US",65.174400329600005,-152.10899352999999]
["TNC","Tin City Long Range Radar Station Airport","US",65.563102720000003,-167.9219971]
["TLA","Teller Airport","US",65.240402221699995,-166.3390045166]
["TOG","Togiak Airport","US",59.052799224899999,-160.39700317379999]
["TKJ","Tok Junction Airport","US",63.329498289999997,-142.9539948]
["TKA","Talkeetna Airport","US",62.320499420200001,-150.09399414059999]
["TLJ","Tatalina LRRS Airport","US",62.894401550300003,-155.977005005]
["ATK","Atqasuk Edward Burnell Sr Memorial Airport","US",70.467300414999997,-157.43600463870001]
["AUK","Alakanuk Airport","US",62.680042266800001,-164.65992736800001]
["UMT","Umiat Airport","US",69.371101379999999,-152.13600159999999]
["UNK","Unalakleet Airport","US",63.888401029999997,-160.79899599999999]
["WOW","Willow Airport","US",61.754199981699998,-150.05200195309999]
["VAK","Chevak Airport","US",61.540900000000001,-165.60050000000001]
["KVC","King Cove Airport","US",55.116298675499998,-162.26600646969999]
["VDZ","Valdez Pioneer Field","US",61.13389969,-146.24800110000001]
["VEE","Venetie Airport","US",67.008697509800001,-146.365997314]
["KVL","Kivalina Airport","US",67.736198425300003,-164.56300354000001]
["WBQ","Beaver Airport","US",66.362197875999996,-147.40699768100001]
["SWD","Seward Airport","US",60.126899719199997,-149.41900634769999]
["WRG","Wrangell Airport","US",56.484298709999997,-132.36999510000001]
["AIN","Wainwright Airport","US",70.638000488299994,-159.994995117]
["WMO","White Mountain Airport","US",64.689201354999994,-163.41299438479999]
["WTK","Noatak Airport","US",67.566101074200006,-162.97500610349999]
["IYS","Wasilla Airport","US",61.571701049799998,-149.53999328610001]
["YAK","Yakutat Airport","US",59.503299713099999,-139.66000366200001]
["CIS","Canton Airport","KI",-2.7681200503999999,-171.71000671389999]
["AKI","Akiak Airport","US",60.9029006958,-161.231002808]
["AET","Allakaket Airport","US",66.5518035889,-152.621994019]
["NCN","Chenega Bay Airport","US",60.077301025399997,-147.99200439500001]
["CLP","Clarks Point Airport","US",58.833698269999999,-158.52900700000001]
["ELI","Elim Airport","US",64.614700319999997,-162.2720032]
["KUK","Kasigluk Airport","US",60.874401089999999,-162.52400209999999]
["KNK","Kokhanok Airport","US",59.433200836200001,-154.80400085400001]
["KOT","Kotlik Airport","US",63.030601501500001,-163.533004761]
["KTS","Brevig Mission Airport","US",65.331298828100003,-166.46600341800001]
["KYU","Koyukuk Airport","US",64.876098632799994,-157.727005005]
["KWT","Kwethluk Airport","US",60.790298461900001,-161.44400024399999]
["ORV","Robert (Bob) Curtis Memorial Airport","US",66.817901610000007,-161.0189972]
["SKK","Shaktoolik Airport","US",64.371101379999999,-161.22399899999999]
["WSN","South Naknek Nr 2 Airport","US",58.703399658199999,-157.00799560499999]
["FYU","Fort Yukon Airport","US",66.571502685499993,-145.25]
["ROP","Rota International Airport","MP",14.174300193800001,145.24299621579999]
["SPN","Francisco C. Ada Saipan International Airport","MP",15.1190004349,145.72900390629999]
["UAM","Andersen Air Force Base","GU",13.5839996338,144.92999267580001]
["GUM","Antonio B. Won Pat International Airport","GU",13.4834003448,144.79600524899999]
["TIQ","Tinian International Airport","MP",14.9991998672,145.6190032959]
["BKH","Barking Sands Airport","US",22.022800445600001,-159.78500366200001]
["HDH","Dillingham Airfield","US",21.579500198400002,-158.19700622600001]
["HHI","Wheeler Army Airfield","US",21.48349953,-158.03999329999999]
["HNM","Hana Airport","US",20.795600891100001,-156.01400756839999]
["JHM","Kapalua Airport","US",20.962900161699999,-156.6730041504]
["JRF","Kalaeloa (John Rodgers Field) Airport","US",21.307399749999998,-158.07000729999999]
["KOA","Kona International At Keahole Airport","US",19.738800048800002,-156.04600524899999]
["LIH","Lihue Airport","US",21.975999832199999,-159.3390045166]
["LUP","Kalaupapa Airport","US",21.211000439999999,-156.97399899999999]
["MKK","Molokai Airport","US",21.1529006958,-157.095993042]
["MUE","Waimea Kohala Airport","US",20.0013008118,-155.66799926760001]
["NGF","Kaneohe Bay MCAS (Marion E. Carl Field) Airport","US",21.450500488300001,-157.76800537099999]
["HNL","Honolulu International Airport","US",21.318700790400001,-157.92199707029999]
["LNY","Lanai Airport","US",20.7856006622,-156.95100402829999]
["OGG","Kahului Airport","US",20.898599624599999,-156.42999267580001]
["PAK","Port Allen Airport","US",21.896900176999999,-159.60299682600001]
["BSF","Bradshaw Army Airfield","US",19.760099410999999,-155.55400085400001]
["ITO","Hilo International Airport","US",19.7213993073,-155.0480041504]
["UPP","Upolu Airport","US",20.2653007507,-155.86000061039999]
["ENT","Eniwetok Airport","MH",11.3407001495,162.32800292970001]
["MAJ","Marshall Islands International Airport","MH",7.0647602081,171.27200317379999]
["KIA","Kaieteur International Airport","GY",5.1727547645999996,-59.491481780999997]
["KWA","Bucholz Army Air Field","MH",8.7201204299999997,167.7319946289]
["CXI","Cassidy International Airport","KI",1.9861600398999999,-157.35000610349999]
["TNV","Tabuaeran Island Airport","KI",3.8994400500999999,-159.38900756839999]
["MDY","Henderson Field","UM",28.201700210599999,-177.3809967041]
["PIZ","Point Lay Lrrs Airport","US",69.732902530000004,-163.00500489999999]
["TKK","Chuuk International Airport","FM",7.4618701935000002,151.84300231930001]
["PNI","Pohnpei International Airport","FM",6.9850997924999998,158.2089996338]
["ROR","Babelthuap Airport","PW",7.3676500320000002,134.54400634769999]
["KSA","Kosrae International Airport","FM",5.3569798469999999,162.95799255399999]
["YAP","Yap International Airport","FM",9.4989099502999998,138.0829925537]
["AWK","Wake Island Airfield","UM",19.282100677500001,166.63600158689999]
["KNH","Kinmen Airport","TW",24.4279003143,118.3590011597]
["PIF","Pingtung North Airport","TW",22.700199127200001,120.4820022583]
["LZN","Matsu Nangan Airport","TW",26.159799575800001,119.9580001831]
["TTT","Taitung Airport","TW",22.754999160800001,121.10199737550001]
["GNI","Lyudao Airport","TW",22.6739006042,121.466003418]
["KHH","Kaohsiung International Airport","TW",22.5771007538,120.3499984741]
["CYI","Chiayi Airport","TW",23.461799621600001,120.3929977417]
["HCN","Hengchun Airport","TW",22.0410995483,120.7300033569]
["TXG","Taichung Airport","TW",24.186300277699999,120.65399932859999]
["KYD","Lanyu Airport","TW",22.027000427200001,121.5350036621]
["RMQ","Taichung Ching Chuang Kang Airport","TW",24.264699935900001,120.6210021973]
["MFK","Matsu Beigan Airport","TW",26.224199294999998,120.00299835209999]
["TNN","Tainan Airport","TW",22.950399398799998,120.2060012817]
["HSZ","Hsinchu Air Base","TW",24.818000793500001,120.9390029907]
["MZG","Makung Airport","TW",23.568700790400001,119.62799835209999]
["TSA","Taipei Songshan Airport","TW",25.069400787399999,121.5520019531]
["TPE","Taiwan Taoyuan International Airport","TW",25.077699661299999,121.23300170900001]
["WOT","Wang-an Airport","TW",23.367372512799999,119.5027770996]
["HUN","Hualien Airport","TW",24.0230998993,121.61799621580001]
["NRT","Narita International Airport","JP",35.764701843300003,140.38600158689999]
["MMJ","Matsumoto Airport","JP",36.166801452599998,137.9230041504]
["IBR","Hyakuri Airport","JP",36.181098937999998,140.414993286]
["MUS","Minami Torishima Airport","JP",24.289699554399999,153.979003906]
["IWO","Iwo Jima Airport","JP",24.784000396700002,141.32299804690001]
["KIX","Kansai International Airport","JP",34.427299499500002,135.2440032959]
["SHM","Nanki Shirahama Airport","JP",33.662200927699999,135.36399841299999]
["UKB","Kobe Airport","JP",34.632801055900003,135.22399902340001]
["HIW","Hiroshimanishi Airport","JP",34.366901397699998,132.41400146480001]
["TJH","Tajima Airport","JP",35.512798309300003,134.78700256350001]
["OBO","Tokachi-Obihiro Airport","JP",42.733299255399999,143.216995239]
["CTS","New Chitose Airport","JP",42.775199890099998,141.69200134280001]
["HKD","Hakodate Airport","JP",41.770000457800002,140.82200622600001]
["KUH","Kushiro Airport","JP",43.041000366200002,144.192993164]
["MMB","Memanbetsu Airport","JP",43.880599975599999,144.16400146500001]
["SHB","Nakashibetsu Airport","JP",43.5774993896,144.960006714]
["OKD","Okadama Airport","JP",43.116100311300002,141.38000488279999]
["RBJ","Rebun Airport Airport","JP",45.455001831099999,141.03900146480001]
["WKJ","Wakkanai Airport","JP",45.4042015076,141.80099487300001]
["AXJ","Amakusa Airport","JP",32.482498168900001,130.15899658199999]
["IKI","Iki Airport","JP",33.7490005493,129.78500366200001]
["UBJ","Yamaguchi Ube Airport","JP",33.930000305199997,131.279006958]
["TSJ","Tsushima Airport","JP",34.2849006653,129.33099365199999]
["MBE","Monbetsu Airport","JP",44.303901672400002,143.404006958]
["AKJ","Asahikawa Airport","JP",43.670799255399999,142.44700622560001]
["OIR","Okushiri Airport","JP",42.071701049799998,139.43299865719999]
["RIS","Rishiri Airport","JP",45.242000579799999,141.186004639]
["KUM","Yakushima Airport","JP",30.3855991364,130.65899658199999]
["FUJ","Fukue Airport","JP",32.666301727300002,128.8329925537]
["FUK","Fukuoka Airport","JP",33.585899353000002,130.45100402829999]
["TNE","New Tanegashima Airport","JP",30.605100631700001,130.99099731449999]
["KOJ","Kagoshima Airport","JP",31.803400039700001,130.71899414059999]
["KMI","Miyazaki Airport","JP",31.877199173000001,131.44900512699999]
["OIT","Oita Airport","JP",33.479400634800001,131.73699951200001]
["KKJ","Kitakyushu Airport","JP",33.845901489299997,131.03500366200001]
["HSG","Saga Airport","JP",33.149700164800002,130.302001953]
["KMJ","Kumamoto Airport","JP",32.837299346899997,130.85499572750001]
["NGS","Nagasaki Airport","JP",32.916900634800001,129.91400146500001]
["NGO","Chubu Centrair International Airport","JP",34.8583984375,136.80499267580001]
["ASJ","Amami Airport","JP",28.430599212600001,129.71299743649999]
["OKE","Okierabu Airport","JP",27.4255008698,128.70100402829999]
["KKX","Kikai Airport","JP",28.3213005066,129.92799377439999]
["TKN","Tokunoshima Airport","JP",27.836399078399999,128.8809967041]
["NKM","Nagoya Airport","JP",35.2550010681,136.92399597170001]
["FKJ","Fukui Airport","JP",36.142799377400003,136.22399902340001]
["QGU","Gifu Airport","JP",35.394100189200003,136.86999511720001]
["KMQ","Komatsu Airport","JP",36.394599914600001,136.40699768069999]
["OKI","Oki Airport","JP",36.181098937999998,133.32499694820001]
["FSZ","Mt. Fuji Shizuoka Airport","JP",34.796043467899999,138.18775177000001]
["TOY","Toyama Airport","JP",36.648300170900001,137.18800354000001]
["NTQ","Noto Airport","JP",37.293098449699997,136.96200561500001]
["HIJ","Hiroshima Airport","JP",34.436100006099998,132.91900634800001]
["OKJ","Okayama Airport","JP",34.756900787399999,133.85499572800001]
["IZO","Izumo Airport","JP",35.413600921600001,132.88999939000001]
["YGJ","Miho Yonago Airport","JP",35.492198944099997,133.23599243160001]
["IWK","Iwakuni Marine Corps Air Station","JP",34.143901825,132.23599243160001]
["KCZ","Kochi Ryoma Airport","JP",33.546100616499999,133.66900634800001]
["MYJ","Matsuyama Airport","JP",33.827201843300003,132.69999694820001]
["ITM","Osaka International Airport","JP",34.785499572799999,135.43800354000001]
["TTJ","Tottori Airport","JP",35.530101776099997,134.16700744600001]
["TKS","Tokushima Airport","JP",34.132801055900003,134.60699462900001]
["TAK","Takamatsu Airport","JP",34.214199066200003,134.01600647000001]
["IWJ","Iwami Airport","JP",34.676399230999998,131.789993286]
["AOJ","Aomori Airport","JP",40.7346992493,140.6909942627]
["GAJ","Yamagata Airport","JP",38.411899566700001,140.371002197]
["SDS","Sado Airport","JP",38.0601997375,138.41400146480001]
["FKS","Fukushima Airport","JP",37.227401733400001,140.43099975589999]
["HHE","Hachinohe Airport","JP",40.556400299099998,141.46600341800001]
["HNA","Hanamaki Airport","JP",39.428600311300002,141.13499450680001]
["AXT","Akita Airport","JP",39.615600585899998,140.21899414059999]
["MSJ","Misawa Air Base","JP",40.703201293900001,141.36799621599999]
["KIJ","Niigata Airport","JP",37.955898284900002,139.121002197]
["ONJ","Odate Noshiro Airport","JP",40.1918983459,140.371002197]
["SDJ","Sendai Airport","JP",38.139701843300003,140.91700744600001]
["SYO","Shonai Airport","JP",38.8121986389,139.78700256299999]
["NJA","Atsugi Naval Air Facility","JP",35.454601287800003,139.44999694820001]
["HAC","Hachijojima Airport","JP",33.115001678500001,139.78599548299999]
["OIM","Oshima Airport","JP",34.782001495400003,139.36000060999999]
["MYE","Miyakejima Airport","JP",34.073600769000002,139.55999755900001]
["HND","Tokyo International Airport","JP",35.552299499500002,139.7799987793]
["QUT","Utsunomiya Airport","JP",36.514499664299997,139.87100219729999]
["OKO","Yokota Air Base","JP",35.748500823999997,139.34800720210001]
["MWX","Muan International Airport","KR",34.991405999999998,126.382814]
["KWJ","Gwangju Airport","KR",35.126399993900002,126.808998108]
["KUV","Kunsan Air Base","KR",35.903800964399998,126.61599731450001]
["CHN","Jeon Ju Airport","KR",35.878398895300002,127.12000274659999]
["RSU","Yeosu Airport","KR",34.842300414999997,127.6169967651]
["QUN","A-306 Airport","KR",37.883800506599997,127.7180023193]
["SHO","Sokcho Airport","KR",38.1426010132,128.59899902340001]
["KAG","Gangneung Airport","KR",37.753601074199999,128.94400024410001]
["WJU","Wonju Airport","KR",37.438098907499999,127.959999084]
["YNY","Yangyang International Airport","KR",38.061298370400003,128.66900634769999]
["CJU","Jeju International Airport","KR",33.5112991333,126.49299621580001]
["JDG","Jeongseok Airport","KR",33.399600982700001,126.7119979858]
["CHF","Jinhae Airport","KR",35.141201019299999,128.6959991455]
["PUS","Gimhae International Airport","KR",35.179500579799999,128.93800354000001]
["HIN","Sacheon Air Base","KR",35.088500976600002,128.07000732419999]
["USN","Ulsan Airport","KR",35.593498230000002,129.352005005]
["ICN","Incheon International Airport","KR",37.4691009521,126.4509963989]
["SSN","Seoul Air Base","KR",37.445800781300001,127.11399841310001]
["OSN","Osan Air Base","KR",37.090599060099997,127.0299987793]
["GMP","Gimpo International Airport","KR",37.558300018300002,126.79100036600001]
["SWU","Suwon Airport","KR",37.239398956300001,127.00700378419999]
["KPO","Pohang Airport","KR",35.987899780299998,129.419998169]
["JWO","Jungwon Air Base","KR",37.029998779300001,127.8850021362]
["TAE","Daegu Airport","KR",35.894100189200003,128.65899658199999]
["HMY","Seosan Air Base","KR",36.703998565699997,126.486000061]
["CJJ","Cheongju International Airport","KR",36.716598510700003,127.499000549]
["YEC","Yecheon Airport","KR",36.631900787399999,128.35499572750001]
["OKA","Naha Airport","JP",26.195800781199999,127.64600372300001]
["DNA","Kadena Air Base","JP",26.355600357099998,127.7679977417]
["ISG","Ishigaki Airport","JP",24.344499588000001,124.18699646]
["UEO","Kumejima Airport","JP",26.3635005951,126.7139968872]
["KJP","Kerama Airport","JP",26.168300628699999,127.2929992676]
["MMD","Minami Daito Airport","JP",25.846500396700002,131.26300048830001]
["MMY","Miyako Airport","JP",24.782800674400001,125.294998169]
["AGJ","Aguni Airport","JP",26.592500686600001,127.24099731450001]
["IEJ","Ie Jima Airport","JP",26.722000122099999,127.7850036621]
["HTR","Hateruma Airport","JP",24.058900833100001,123.8059997559]
["KTD","Kitadaito Airport","JP",25.944700241100001,131.3269958496]
["SHI","Shimojishima Airport","JP",24.826700210599999,125.1449966431]
["TRA","Tarama Airport","JP",24.6539001465,124.6750030518]
["RNJ","Yoron Airport","JP",27.044000625599999,128.40199279789999]
["OGN","Yonaguni Airport","JP",24.466899871799999,122.9779968262]
["SFS","Subic Bay International Airport","PH",14.7944002151,120.27100372309999]
["CRK","Diosdado Macapagal International Airport","PH",15.1859998703,120.559997559]
["LAO","Laoag International Airport","PH",18.178100585900001,120.5319976807]
["DRP","Legazpi Bicol International Airport","PH",13.1122222,123.6772222]
["MNL","Ninoy Aquino International Airport","PH",14.508600234999999,121.019996643]
["CYU","Cuyo Airport","PH",10.8580999374,121.0690002441]
["LGP","Legazpi City International Airport","PH",13.157500000000001,123.735]
["NSP","Sangley Point Air Base","PH",14.4954004288,120.90399932859999]
["LBX","Lubang Airport","PH",13.855400085399999,120.1050033569]
["AAV","Allah Valley Airport","PH",6.3668198586000004,124.75099945069999]
["GES","Tambler Airport","PH",6.0580000877,125.09600067140001]
["CBO","Awang Airport","PH",7.1652398109000002,124.2099990845]
["DVO","Francisco Bangoy International Airport","PH",7.1255202293000002,125.64600372309999]
["BXU","Bancasi Airport","PH",8.9513196945000004,125.4779968262]
["BPH","Bislig Airport","PH",8.1959495544000003,126.3219985962]
["DPL","Dipolog Airport","PH",8.6019834987999992,123.34187507599999]
["CGM","Camiguin Airport","PH",9.2535200118999992,124.7070007324]
["IGN","Iligan Airport","PH",8.1304903030000002,124.2149963379]
["JOL","Jolo Airport","PH",6.0536699294999998,121.01100158689999]
["CGY","Malaybalay Airport","PH",8.1416597365999994,125.1169967651]
["MLP","Malabang Airport","PH",7.6172199248999997,124.0589981079]
["SGS","Sanga Sanga Airport","PH",5.0469899178000004,119.74299621580001]
["OZC","Labo Airport","PH",8.1785097122000003,123.84200286870001]
["PAG","Pagadian Airport","PH",7.8307314478999999,123.46117973299999]
["MXI","Mati National Airport","PH",6.9493699074000004,126.27300262449999]
["SUG","Surigao Airport","PH",9.7558383255999992,125.480947495]
["CDY","Cagayan de Sulu Airport","PH",7.0139999389999996,118.4960021973]
["IPE","Ipil Airport","PH",7.7855601310999996,122.60199737550001]
["TDG","Tandag Airport","PH",9.0721101761000007,126.1709976196]
["ZAM","Zamboanga International Airport","PH",6.9224200249000001,122.0599975586]
["IAO","Siargao Airport","PH",9.8591003417999996,126.013999939]
["RZP","Cesar Lim Rodriguez Airport","PH",10.81874,119.50769699999999]
["TAG","Tagbilaran Airport","PH",9.6640796660999992,123.8529968262]
["BAG","Loakan Airport","PH",16.375099182100001,120.62000274659999]
["DTE","Daet Airport","PH",14.129199981699999,122.9800033569]
["SJI","San Jose Airport","PH",12.3614997864,121.04699707]
["MBO","Mamburao Airport","PH",13.2081003189,120.6050033569]
["WNP","Naga Airport","PH",13.5848999023,123.2699966431]
["BSO","Basco Airport","PH",20.451299667400001,121.980003357]
["BQA","Dr.Juan C. Angara Airport","PH",15.7298002243,121.5]
["SFE","San Fernando Airport","PH",16.595600128200001,120.3030014038]
["TUG","Tuguegarao Airport","PH",17.643367682299999,121.733150482]
["VRC","Virac Airport","PH",13.576399803199999,124.2060012817]
["MRQ","Marinduque Airport","PH",13.361000061,121.8259963989]
["CYZ","Cauayan Airport","PH",16.929899215700001,121.75299835200001]
["TAC","Daniel Z. Romualdez Airport","PH",11.2276000977,125.027999878]
["BCD","Bacolod-Silay City International Airport","PH",10.776399612400001,123.01499938960001]
["CYP","Calbayog Airport","PH",12.072699546799999,124.54499816889999]
["DGT","Sibulan Airport","PH",9.3337097167999996,123.30000305199999]
["MPH","Godofredo P. Ramos Airport","PH",11.9245004654,121.95400238000001]
["CRM","Catarman National Airport","PH",12.502400398300001,124.63600158689999]
["ILO","Iloilo International Airport","PH",10.833017,122.493358]
["MBT","Moises R. Espinosa Airport","PH",12.369400024400001,123.628997803]
["KLO","Kalibo International Airport","PH",11.679400444000001,122.375999451]
["CEB","Mactan Cebu International Airport","PH",10.3074998856,123.97899627690001]
["OMC","Ormoc Airport","PH",11.0579996109,124.5650024414]
["PPS","Puerto Princesa Airport","PH",9.7421197891000002,118.75900268549999]
["RXS","Roxas Airport","PH",11.597700119000001,122.7519989014]
["EUQ","Evelio Javier Airport","PH",10.765999794000001,121.932998657]
["TBH","Romblon Airport","PH",12.3109998703,122.084999084]
["USU","Francisco B. Reyes Airport","PH",12.121500015300001,120.099998474]
["BPR","Borongan Airport","PH",11.674300193800001,125.47899627699999]
["ENI","El Nido Airport","PH",11.202500000000001,119.416]
["CCT","Colonia Catriel Airport","AR",-37.910198211699999,-67.834999084499998]
["COC","Comodoro Pierrestegui Airport","AR",-31.296900000000001,-57.996600000000001]
["GHU","Gualeguaychu Airport","AR",-33.010300000000001,-58.613100000000003]
["JNI","Junin Airport","AR",-34.545900000000003,-60.930599999999998]
["PRA","General Urquiza Airport","AR",-31.794799999999999,-60.480400000000003]
["ROS","Islas Malvinas Airport","AR",-32.903599999999997,-60.784999999999997]
["SFN","Sauce Viejo Airport","AR",-31.7117,-60.811700000000002]
["AEP","Jorge Newbery Airpark","AR",-34.559199999999997,-58.415599999999998]
["LCM","La Cumbre Airport","AR",-31.0058002472,-64.531898498499999]
["COR","Ingeniero Ambrosio Taravella Airport","AR",-31.323600768999999,-64.208000183099998]
["FDO","San Fernando Airport","AR",-34.453200000000002,-58.589599999999997]
["LPG","La Plata Airport","AR",-34.972200000000001,-57.8947]
["EPA","El Palomar Airport","AR",-34.609900000000003,-58.6126]
["MJR","Miramar Airport","AR",-38.2271,-57.869700000000002]
["EZE","Ministro Pistarini International Airport","AR",-34.822200000000002,-58.535800000000002]
["RAF","Rafaela Airport","AR",-31.282499999999999,-61.5017]
["NCJ","Sunchales Aeroclub Airport","AR",-30.9575,-61.528300000000002]
["HOS","Chos Malal Airport","AR",-37.444698333700003,-70.222503662099996]
["CVH","Caviahue Airport","AR",-37.851398467999999,-71.009201049799998]
["GNR","Dr. Arturo H. Illia Airport","AR",-39.000701904300001,-67.620498657200002]
["RDS","Rincon De Los Sauces Airport","AR",-37.390598297099999,-68.904197692899999]
["APZ","Zapala Airport","AR",-38.975498199500002,-70.113601684599999]
["MDZ","El Plumerillo Airport","AR",-32.831699371299997,-68.792900085400007]
["LGS","Comodoro D.R. Salomon Airport","AR",-35.493598937999998,-69.574302673299997]
["AFA","Suboficial Ay Santiago Germano Airport","AR",-34.588298797599997,-68.403900146500007]
["CTC","Catamarca Airport","AR",-28.595600128200001,-65.751701354999994]
["SDE","Vicecomodoro Angel D. La Paz Aragones Airport","AR",-27.765556335399999,-64.309997558600003]
["RHD","Las Termas Airport","AR",-27.473699569699999,-64.905502319299998]
["IRJ","Capitan V A Almonacid Airport","AR",-29.381599426299999,-66.795799255399999]
["TUC","Teniente Benjamin Matienzo Airport","AR",-26.840900421099999,-65.104896545399995]
["UAQ","Domingo Faustino Sarmiento Airport","AR",-31.571500778200001,-68.418197631799998]
["CRR","Ceres Airport","AR",-29.863099999999999,-61.872799999999998]
["RCU","Area De Material Airport","AR",-33.085098266599999,-64.2612991333]
["VDR","Villa Dolores Airport","AR",-31.945199966400001,-65.1463012695]
["VME","Villa Reynolds Airport","AR",-33.729900360099997,-65.387397766099994]
["RLO","Valle Del Conlara International Airport","AR",-32.384700775100001,-65.186500549300007]
["LUQ","Brigadier Mayor D Cesar Raul Ojeda Airport","AR",-33.273200988799999,-66.3563995361]
["CNQ","Corrientes Airport","AR",-27.445499999999999,-58.761899999999997]
["RES","Resistencia International Airport","AR",-27.45,-59.056100000000001]
["FMA","Formosa Airport","AR",-26.212700000000002,-58.228099999999998]
["IGR","Cataratas Del Iguazu International Airport","AR",-25.737300872799999,-54.473400116000001]
["AOL","Paso De Los Libres Airport","AR",-29.689399999999999,-57.152099999999997]
["MCS","Monte Caseros Airport","AR",-30.271899999999999,-57.6402]
["PSS","Libertador Gral D Jose De San Martin Airport","AR",-27.3858,-55.970700000000001]
["PRQ","Termal Airport","AR",-26.753610610999999,-60.492221832299997]
["SLA","Martin Miguel De Guemes International Airport","AR",-24.8560009003,-65.486198425300003]
["JUJ","Gobernador Horacio Guzman International Airport","AR",-24.392799377399999,-65.097801208500002]
["ORA","Oran Airport","AR",-23.1527996063,-64.329200744600001]
["TTG","General Enrique Mosconi Airport","AR",-22.619600296000002,-63.793701171899997]
["CLX","Clorinda Airport","AR",-25.303599999999999,-57.734400000000001]
["ELO","El Dorado Airport","AR",-26.397499084500001,-54.574699401899998]
["OYA","Goya Airport","AR",-29.105799999999999,-59.218899999999998]
["LLS","Alferez Armando Rodriguez Airport","AR",-24.7213993073,-60.548801422099999]
["MDX","Mercedes Airport","AR",-29.2213993073,-58.087799072300001]
["RCQ","Reconquista Airport","AR",-29.2103,-59.68]
["UZU","Curuzu Cuatia Airport","AR",-29.770600000000002,-57.978900000000003]
["EHL","El Bolson Airport","AR",-41.943199157700001,-71.532302856399994]
["CRD","General E. Mosconi Airport","AR",-45.785299999999999,-67.465500000000006]
["EMX","El Maiten Airport","AR",-42.0292015076,-71.172500610399993]
["EQS","Brigadier Antonio Parodi Airport","AR",-42.908000946000001,-71.139503478999998]
["LHS","Las Heras Airport","AR",-46.5382995605,-68.965301513699998]
["IGB","Cabo F.A.A. H. R. Bordon Airport","AR",-41.320899963400002,-69.574897766099994]
["OLN","Lago Musters Airport","AR",-45.577777777800002,-69.072777777799999]
["OES","Antoine De St Exupery Airport","AR",-40.751199999999997,-65.034300000000002]
["MQD","Maquinchao Airport","AR",-41.243099212600001,-68.707801818799993]
["ARR","D. Casimiro Szlapelis Airport","AR",-45.0135993958,-70.812202453599994]
["SGV","Sierra Grande Airport","AR",-41.5917015076,-65.339401245100007]
["REL","Almirante Marco Andres Zar Airport","AR",-43.210500000000003,-65.270300000000006]
["VDM","Gobernador Castello Airport","AR",-40.869199999999999,-63.000399999999999]
["PMY","El Tehuelche Airport","AR",-42.7592,-65.102699999999999]
["ING","Lago Argentino Airport","AR",-50.336101532000001,-72.248596191399997]
["FTE","El Calafate Airport","AR",-50.280300140400001,-72.053100585899998]
["PUD","Puerto Deseado Airport","AR",-47.735300000000002,-65.9041]
["RGA","Hermes Quijada International Airport","AR",-53.777700000000003,-67.749399999999994]
["RGL","Piloto Civil N. Fernandez Airport","AR",-51.608899999999998,-69.312600000000003]
["USH","Malvinas Argentinas Airport","AR",-54.843299999999999,-68.2958]
["ULA","Capitan D Daniel Vazquez Airport","AR",-49.306800000000003,-67.802599999999998]
["ROY","Rio Mayo Airport","AR",-45.703899383500001,-70.245597839400006]
["PMQ","Perito Moreno Airport","AR",-46.537899017299999,-70.9786987305]
["GGS","Gobernador Gregores Airport","AR",-48.783100128199997,-70.150001525899995]
["JSM","Jose De San Martin Airport","AR",-44.048599243200002,-70.458900451700003]
["RYO","28 De Noviembre Airport","AR",-51.609199523900003,-72.221702575699993]
["RZA","Santa Cruz Airport","AR",-50.016500000000001,-68.5792]
["BHI","Comandante Espora Airport","AR",-38.725000000000001,-62.1693]
["CSZ","Brigadier D.H.E. Ruiz Airport","AR",-37.446098327599998,-61.8893013]
["OVR","Olavarria Airport","AR",-36.8899993896,-60.216598510700003]
["GPO","General Pico Airport","AR",-35.696201324500002,-63.758300781199999]
["OYO","Tres Arroyos Airport","AR",-38.386899999999997,-60.329700000000003]
["SST","Santa Teresita Airport","AR",-36.542299999999997,-56.721800000000002]
["MDQ","Astor Piazzola International Airport","AR",-37.934199999999997,-57.573300000000003]
["NQN","Presidente Peron Airport","AR",-38.949001312299998,-68.155700683600003]
["NEC","Necochea Airport","AR",-38.4831,-58.8172]
["PEH","Comodoro Pedro Zanni Airport","AR",-35.8446,-61.857599999999998]
["RSA","Santa Rosa Airport","AR",-36.588298797599997,-64.275703430199997]
["BRC","San Carlos De Bariloche Airport","AR",-41.151199340799998,-71.157501220699999]
["TDL","Heroes De Malvinas Airport","AR",-37.2374000549,-59.227901458700003]
["VLG","Villa Gesell Airport","AR",-37.235399999999998,-57.029200000000003]
["CUT","Cutral-Co Airport","AR",-38.939701080299997,-69.2646026611]
["CPC","Aviador C. Campos Airport","AR",-40.0754013062,-71.137298584000007]
["CDJ","Conceicao do Araguaia Airport","BR",-8.3483495712,-49.301498413099999]
["JTC","Bauru-Arealva Airport","BR",-22.157779999999999,-49.068330000000003]
["AQA","Araraquara Airport","BR",-21.812000274700001,-48.132999420200001]
["AJU","Santa Maria Airport","BR",-10.984000205999999,-37.070301055900003]
["AIF","Marcelo Pires Halzhausen Airport","BR",-22.64,-50.453055999999997]
["AFL","Alta Floresta Airport","BR",-9.8663892745999995,-56.104999542199998]
["ARU","Aracatuba Airport","BR",-21.1413002014,-50.424701690699997]
["AAX","Araxa Airport","BR",-19.5631999969,-46.960399627699999]
["BEL","Val de Cans/Julio Cezar Ribeiro International Airport","BR",-1.3792500496,-48.476299285899998]
["BGX","Comandante Gustavo Kraemer Airport","BR",-31.390499115000001,-54.112201690699997]
["PLU","Pampulha - Carlos Drummond de Andrade Airport","BR",-19.8512001038,-43.950599670400003]
["BFH","Bacacheri Airport","BR",-25.405099868800001,-49.231998443599998]
["BJP","Aeroporto Estadual Arthur Siqueira Airport","BR",-22.979167,-46.537500000000001]
["QAK","Major Brigadeiro Doorgal Borges Airport","BR",-21.267200469999999,-43.761100769000002]
["BSB","Presidente Juscelino Kubistschek International Airport","BR",-15.8691673279,-47.920833587600001]
["BAT","Chafei Amsei Airport","BR",-20.584499359100001,-48.5941009521]
["BAU","Bauru Airport","BR",-22.344999313399999,-49.053798675499998]
["BVB","Atlas Brasil Cantanhede Airport","BR",2.8413889407999999,-60.692222595200001]
["BPG","Barra do Garcas Airport","BR",-15.8613004684,-52.388900756799998]
["BZC","Umberto Modiano Airport","BR",-22.7709999084,-41.962898254400002]
["CAC","Cascavel Airport","BR",-25.000299453699999,-53.500801086400003]
["CFB","Cabo Frio Airport","BR",-22.921699523899999,-42.074298858600002]
["CFC","Cacador Airport","BR",-26.78840065,-50.9398002625]
["CNF","Tancredo Neves International Airport","BR",-19.6244430542,-43.971942901600002]
["CGR","Campo Grande Airport","BR",-20.468700408899998,-54.6725006104]
["XAP","Chapeco Airport","BR",-27.134199142500002,-52.6566009521]
["CLN","Brig. Lysias Augusto Rodrigues Airport","BR",-7.3204398155000003,-47.458698272699998]
["CKS","Carajas Airport","BR",-6.1152777672000003,-50.001388549799998]
["CCM","Forquilhinha - Criciuma Airport","BR",-28.7244434357,-49.4213905334]
["CLV","Caldas Novas Airport","BR",-17.725299835200001,-48.607498168900001]
["QNS","Canoas Airport","BR",-29.945899963399999,-51.144401550300003]
["CAW","Bartolomeu Lisandro Airport","BR",-21.698299408,-41.301700592000003]
["CMG","Corumba International Airport","BR",-19.011943817100001,-57.6713905334]
["CWB","Afonso Pena Airport","BR",-25.528499603299998,-49.175800323499999]
["CRQ","Caravelas Airport","BR",-17.652299881000001,-39.253101348900003]
["CXJ","Campo dos Bugres Airport","BR",-29.1970996857,-51.1875]
["CGB","Marechal Rondon Airport","BR",-15.652899742100001,-56.116699218800001]
["CZS","Cruzeiro do Sul Airport","BR",-7.5999097824000001,-72.769500732400004]
["BYO","Bonito Airport","BR",-21.2294445038,-56.456111907999997]
["PPB","Presidente Prudente Airport","BR",-22.175100326500001,-51.4245986938]
["MAO","Eduardo Gomes International Airport","BR",-3.0386099815000001,-60.049701690699997]
["JCR","Jacareacanga Airport","BR",-6.2331600188999996,-57.776901245099999]
["ESI","Espinosa Airport","BR",-14.9336944444,-42.81]
["IGU","Cataratas International Airport","BR",-25.600278854399999,-54.4850006104]
["FLN","Hercilio Luz International Airport","BR",-27.670278549199999,-48.552501678500001]
["FEN","Fernando de Noronha Airport","BR",-3.8549299239999999,-32.423301696800003]
["FOR","Pinto Martins International Airport","BR",-3.7762799263,-38.5326004028]
["GIG","Galeao - Antonio Carlos Jobim International Airport","BR",-22.809999465899999,-43.2505569458]
["GJM","Guajara-Mirim Airport","BR",-10.7863998413,-65.284797668500005]
["GYN","Santa Genoveva Airport","BR",-16.631999969500001,-49.220699310299999]
["GRU","Guarulhos - Governador Andre Franco Montoro International Airport","BR",-23.435556411699999,-46.473056793200001]
["GPB","Tancredo Thomas de Faria Airport","BR",-25.3875007629,-51.520198821999998]
["GVR","Governador Valadares Airport","BR",-18.895200729399999,-41.982200622599997]
["GUJ","Guaratingueta Airport","BR",-22.791599273700001,-45.2047996521]
["ATM","Altamira Airport","BR",-3.2539100646999999,-52.2540016174]
["ITA","Itacoatiara Airport","BR",-3.1272599696999999,-58.481201171899997]
["ITB","Itaituba Airport","BR",-4.2423400878999997,-56.000701904300001]
["IOS","Bahia - Jorge Amado Airport","BR",-14.815999984699999,-39.033199310299999]
["IPN","Usiminas Airport","BR",-19.470699310299999,-42.487598419199998]
["IMP","Prefeito Renato Moreira Airport","BR",-5.5312900543000003,-47.459999084499998]
["JJD","Comte. Ariston Pessoa Regional Airport","BR",-2.9066670000000001,-40.358055999999998]
["JDF","Francisco de Assis Airport","BR",-21.7915000916,-43.386798858600002]
["JHF","São Paulo Catarina Executive Airport","BR",-23.426943999999999,-47.165832999999999]
["JPA","Presidente Castro Pinto Airport","BR",-7.1458330154,-34.948612213099999]
["JDO","Orlando Bezerra de Menezes Airport","BR",-7.2189598084000002,-39.270099639900003]
["JOI","Lauro Carneiro de Loyola Airport","BR",-26.224500656099998,-48.797401428199997]
["CPV","Presidente Joao Suassuna Airport","BR",-7.2699198723,-35.896400451700003]
["VCP","Viracopos International Airport","BR",-23.007400512699999,-47.134498596199997]
["LEC","Chapada Diamantina Airport","BR",-12.4822998047,-41.277000427200001]
["LAJ","Lages Airport","BR",-27.782100677500001,-50.281501769999998]
["LIP","Lins Airport","BR",-21.663999557499999,-49.730499267600003]
["LDB","Governador Jose Richa Airport","BR",-23.3335990906,-51.130100250200002]
["LAZ","Bom Jesus da Lapa Airport","BR",-13.262100219700001,-43.408100128199997]
["MAB","Maraba Airport","BR",-5.3685898780999999,-49.138000488300001]
["MQH","Minacu Airport","BR",-13.5490999222,-48.195301055900003]
["MEU","Monte Dourado Airport","BR",-0.88983899349999995,-52.602199554400002]
["MEA","Macae Airport","BR",-22.343000411999999,-41.7659988403]
["MGF","Regional de Maringa - Silvio Nane Junior Airport","BR",-23.4794445038,-52.012222289999997]
["MOC","Mario Ribeiro Airport","BR",-16.706899642900002,-43.818901062000002]
["MII","Marilia Airport","BR",-22.196899414099999,-49.926399230999998]
["PLL","Ponta Pelada Airport","BR",-3.1460399628000002,-59.986301422099999]
["MCZ","Zumbi dos Palmares Airport","BR",-9.5108098983999998,-35.791698455800002]
["MCP","Alberto Alcolumbre Airport","BR",5.0664000200000003E-2,-51.072200775100001]
["MVF","Dix-Sept Rosado Airport","BR",-5.2019200325000003,-37.364299774199999]
["SAO","Campo de Marte Airport","BR",-23.509099960299999,-46.637798309300003]
["MNX","Manicore Airport","BR",-5.8113799095000003,-61.278301239000001]
["NVT","Ministro Victor Konder International Airport","BR",-26.879999160800001,-48.651401519799997]
["GEL","Santo Angelo Airport","BR",-28.281700134299999,-54.169101715099998]
["NAT","Augusto Severo Airport","BR",-5.9114198685000003,-35.2476997375]
["OYK","Oiapoque Airport","BR",3.8554899693000002,-51.796901702900001]
["POA","Salgado Filho Airport","BR",-29.994400024400001,-51.171398162800003]
["PHB","Prefeito Doutor Joao Silva Filho Airport","BR",-2.8937499522999999,-41.731998443599998]
["POO","Pocos de Caldas Airport","BR",-21.843000411999999,-46.567901611300002]
["PFB","Lauro Kurtz Airport","BR",-28.243999481199999,-52.326599121100003]
["PMW","Brigadeiro Lysias Rodrigues Airport","BR",-10.2915000916,-48.356998443599998]
["PET","Pelotas Airport","BR",-31.7183990479,-52.327701568599998]
["PNZ","Senador Nilo Coelho Airport","BR",-9.3624095917000005,-40.569099426299999]
["PNB","Porto Nacional Airport","BR",-10.7194004059,-48.399700164800002]
["PMG","Ponta Pora Airport","BR",-22.549600601200002,-55.702598571800003]
["BPS","Porto Seguro Airport","BR",-16.4386005402,-39.080898284900002]
["PVH","Governador Jorge Teixeira de Oliveira Airport","BR",-8.7092895507999994,-63.902301788300001]
["VDC","Glauber Rocha Airport","BR",-14.907778,-40.914721999999998]
["RBR","Placido de Castro Airport","BR",-9.8688888549999998,-67.898056030299998]
["REC","Guararapes - Gilberto Freyre International Airport","BR",-8.1264896393000008,-34.923599243200002]
["SDU","Santos Dumont Airport","BR",-22.910499572799999,-43.163101196299998]
["RAO","Leite Lopes Airport","BR",-21.136388778699999,-47.7766685486]
["BRB","Barreirinhas Airport","BR",-2.7555555556,-42.81]
["SNZ","Santa Cruz Airport","BR",-22.932399749799998,-43.7191009521]
["SJK","Professor Urbano Ernesto Stumpf Airport","BR",-23.2292003632,-45.861499786400003]
["SLZ","Marechal Cunha Machado International Airport","BR",-2.5853600501999998,-44.234100341800001]
["RIA","Santa Maria Airport","BR",-29.711399078399999,-53.688201904300001]
["STM","Maestro Wilson Fonseca Airport","BR",-2.4247219563,-54.7858314514]
["CGH","Congonhas Airport","BR",-23.626110076900002,-46.656387329099999]
["SJP","Sao Jose do Rio Preto Airport","BR",-20.8166007996,-49.406501769999998]
["SSZ","Base Aerea de Santos Airport","BR",-23.928056716899999,-46.299720764200003]
["SSA","Deputado Luiz Eduardo Magalhaes International Airport","BR",-12.068355039634,-45.711454410757099]
["QHP","Base de Aviacao de Taubate Airport","BR",-23.040100097700002,-45.5159988403]
["TMT","Trombetas Airport","BR",-1.4895999432,-56.396800994899998]
["UNA","Hotel Transamerica Airport","BR",-15.355199813800001,-38.9990005493]
["TOW","Toledo Airport","BR",-24.686300277699999,-53.697498321499999]
["THE","Senador Petronio Portela Airport","BR",-5.0599398613000002,-42.823501586900001]
["TFF","Tefe Airport","BR",-3.3829400539000001,-64.724098205600001]
["TJL","Plinio Alarcom Airport","BR",-20.754443999999999,-51.683889000000001]
["TRQ","Tarauaca Airport","BR",-8.1552600861000002,-70.783302307100001]
["TEC","Telemaco Borba Airport","BR",-24.317800521900001,-50.651599883999999]
["TBT","Tabatinga Airport","BR",-4.2556700705999999,-69.935798645000006]
["TUR","Tucurui Airport","BR",-3.7860100269000001,-49.720298767099997]
["SJL","Sao Gabriel da Cachoeira Airport","BR",-0.14835000000000001,-66.985500000000002]
["PAV","Paulo Afonso Airport","BR",-9.4008798598999999,-38.250598907499999]
["URG","Rubem Berta Airport","BR",-29.782199859599999,-57.038200378399999]
["UDI","Ten. Cel. Aviador Cesar Bombonato Airport","BR",-18.883611679099999,-48.225276946999998]
["UBA","Mario de Almeida Franco Airport","BR",-19.764722824100001,-47.966110229500003]
["VAG","Major Brigadeiro Trompowsky Airport","BR",-21.5900993347,-45.473300933799997]
["BVH","Vilhena Airport","BR",-12.6943998337,-60.098300933799997]
["VIX","Eurico de Aguiar Salles Airport","BR",-20.2580566406,-40.2863883972]
["QPS","Campo Fontenelle Airport","BR",-21.984600067100001,-47.334800720200001]
["IZA","Zona da Mata Regional Airport","BR",-21.5130558014,-43.1730575562]
["ZUD","Pupelde Airport","CL",-41.9039001465,-73.796699523900003]
["LOB","San Rafael Airport","CL",-32.814201355000002,-70.646697997999993]
["WAP","Alto Palena Airport","CL",-43.611900329599997,-71.806098938000005]
["ARI","Chacalluta Airport","CL",-18.348499298099998,-70.338699340800005]
["WPA","Cabo 1° Juan Roman Airport","CL",-45.3992004395,-72.670303344700002]
["CPO","Desierto de Atacama Airport","CL",-27.261199951199998,-70.779197692899999]
["BBA","Balmaceda Airport","CL",-45.916099548299997,-71.6894989014]
["TOQ","Barriles Airport","CL",-22.141099929799999,-70.062896728499993]
["CCH","Chile Chico Airport","CL",-46.583301544199998,-71.687400817899999]
["CJC","El Loa Airport","CL",-22.498199462900001,-68.903602600100001]
["YAI","Gral. Bernardo O´Higgins Airport","CL",-36.582500457800002,-72.031402587900004]
["PUQ","Pdte. Carlos Ibanez del Campo Airport","CL",-53.002601623499999,-70.854598999000004]
["COW","Tambillos Airport","CL",-30.198889000000001,-71.246943999999999]
["GXQ","Teniente Vidal Airport","CL",-45.594200134300003,-72.106101989699994]
["IQQ","Diego Aracena Airport","CL",-20.535200118999999,-70.181297302199994]
["SCL","Comodoro Arturo Merino Benitez International Airport","CL",-33.393001556400002,-70.785797119099996]
["ESR","Ricardo Garcia Posada Airport","CL",-26.311100006099998,-69.765197753899997]
["FRT","Fundo Tehuen Airport","CL",-41.095001220699999,-73.126663207999997]
["ANF","Cerro Moreno Airport","CL",-23.444499969500001,-70.445098877000007]
["WPR","Capitan Fuentes Martinez Airport Airport","CL",-53.2537002563,-70.319198608400001]
["FFU","Futaleufu Airport","CL",-43.189201355000002,-71.851097106899999]
["LSQ","Maria Dolores Airport","CL",-37.401699066200003,-72.425399780299998]
["WPU","Guardiamarina Zanartu Airport","CL",-54.931098937999998,-67.626296997099999]
["LGR","Cochrane Airport","CL",-47.243801116900002,-72.588401794399999]
["CCP","Carriel Sur Airport","CL",-36.772701263400002,-73.0631027222]
["IPC","Mataveri Airport","CL",-27.164800643900001,-109.42199707]
["ZOS","Canal Bajo Carlos - Hott Siebert Airport","CL",-40.611198425300003,-73.060997009299996]
["CPP","Coposa Airport","CL",-20.750499725299999,-68.683502197300001]
["VLR","Vallenar Airport","CL",-28.5963993073,-70.755996704099999]
["ZLR","Municipal de Linares Airport","CL",-35.861698150599999,-71.548599243200002]
["PNT","Tte. Julio Gallardo Airport","CL",-51.6715011597,-72.528396606399994]
["OVL","El Tuqui Airport","CL",-30.559200286900001,-71.1755981445]
["ZPC","Pucon Airport","CL",-39.292800903299998,-71.915901184099994]
["MHC","Mocopulli Airport","CL",-42.340277999999998,-73.715556000000007]
["PUX","El Mirador Airport","CL",-41.349399566700001,-72.946701049799998]
["CNR","Chanaral Airport","CL",-26.332500457799998,-70.607299804700006]
["VAP","Rodelillo Airport","CL",-33.068099975599999,-71.557502746599994]
["QRC","De La Independencia Airport","CL",-34.173698425300003,-70.775703430199997]
["TNM","Teniente Rodolfo Marsh Martin Base","AQ",-62.190799713099999,-58.986698150599999]
["SMB","Franco Bianco Airport","CL",-52.736698150599999,-69.333602905299998]
["LSC","La Florida Airport","CL",-29.916200637799999,-71.199501037600001]
["SSD","Victor Lafon Airport","CL",-32.745800018300002,-70.705001831100006]
["WCA","Gamboa Airport","CL",-42.490299224899999,-73.772796630900004]
["ZCO","Maquehue Airport","CL",-38.766799926799997,-72.637100219700002]
["PMC","El Tepual Airport","CL",-41.438899993900002,-73.094001770000006]
["TLX","Panguilemo Airport","CL",-35.377799987800003,-71.601699829099999]
["WCH","Chaiten Airport","CL",-42.932800293,-72.699096679700006]
["ZIC","Victoria Airport","CL",-38.2456016541,-72.348602294900004]
["TTC","Las Breas Airport","CL",-25.564300537099999,-70.375900268600006]
["ZAL","Pichoy Airport","CL",-39.650001525900002,-73.086097717300007]
["KNA","Vina del mar Airport","CL",-32.949600219700002,-71.478599548299997]
["CPQ","Amarais Airport","BR",-22.859199523899999,-47.108200073200003]
["QCJ","Botucatu Airport","BR",-22.9395008087,-48.467998504599997]
["OLC","Senadora Eunice Micheles Airport","BR",-3.4679295077000001,-68.920412063599997]
["SOD","Sorocaba Airport","BR",-23.478000640899999,-47.490001678500001]
["QDC","Dracena Airport","BR",-21.460500717199999,-51.606899261499997]
["JLS","Jales Airport","BR",-20.292999267599999,-50.546398162800003]
["QOA","Mococa Airport","BR",-21.487800598100002,-47.034400939900003]
["QGC","Lencois Paulista Airport","BR",-22.578399658199999,-48.774600982700001]
["QNV","Aeroclube Airport","BR",-22.745300293,-43.460300445599998]
["OUS","Ourinhos Airport","BR",-22.966499328600001,-49.9132995605]
["OIA","Ourilandia do Norte Airport","BR",-6.7631001472000003,-51.0499000549]
["QHB","Piracicaba Airport","BR",-22.711500167800001,-47.618198394799997]
["QIQ","Rio Claro Airport","BR",-22.431100845300001,-47.564201355000002]
["QVP","Avare-Arandu Airport","BR",-23.092500686600001,-48.9874000549]
["QRZ","Resende Airport","BR",-22.478500366199999,-44.480300903299998]
["QSC","Sao Carlos Airport","BR",-21.875400543200001,-47.903701782200002]
["UBT","Ubatuba Airport","BR",-23.441099166899999,-45.075599670400003]
["ITP","Itaperuna Airport","BR",-21.219299316400001,-41.875900268599999]
["QGS","Alagoinhas Airport","BR",-12.175100326500001,-38.380199432399998]
["VOT","Votuporanga Airport","BR",-20.463199615499999,-50.004501342799998]
["QGB","Limeira Airport","BR",-22.603888999999999,-47.411943999999998]
["ATF","Chachoan Airport","EC",-1.2120699882999999,-78.574600219700002]
["OCC","Francisco De Orellana Airport","EC",-0.46288600559999998,-76.986801147500003]
["CUE","Mariscal Lamar Airport","EC",-2.8894701004000001,-78.984397888199993]
["GPS","Seymour Airport","EC",-0.45375800129999999,-90.265899658199999]
["GYE","Simon Bolivar International Airport","EC",-2.1574199200000002,-79.883598327599998]
["IBB","General Villamil Airport","EC",-0.94262802599999995,-90.953002929700006]
["JIP","Jipijapa Airport","EC",-1,-80.666664123499999]
["LTX","Cotopaxi International Airport","EC",-0.90683299299999998,-78.615798950200002]
["MRR","Jose Maria Velasco Ibarra Airport","EC",-4.3782300949000001,-79.941001892100005]
["XMS","Coronel E Carvajal Airport","EC",-2.2991700171999998,-78.120796203599994]
["MCH","General Manuel Serrano Airport","EC",-3.2688999176000002,-79.961601257300003]
["MEC","Eloy Alfaro International Airport","EC",-0.94607800249999996,-80.678802490199999]
["LGQ","Nueva Loja Airport","EC",9.3056000799999997E-2,-76.867500305199997]
["PYO","Putumayo Airport","EC",8.3333000500000004E-2,-75.900001525899995]
["PVO","Reales Tamarindos Airport","EC",-1.0416500568,-80.472198486300002]
["UIO","Nuevo Aeropuerto Internacional Mariscal Sucre","EC",-0.12916666669999999,-78.357500000000002]
["ETR","Coronel Artilleria Victor Larrea Airport","EC",-3.4351599217,-79.977798461899994]
["SNC","General Ulpiano Paez Airport","EC",-2.2049899101000001,-80.988899231000005]
["SUQ","Sucua Airport","EC",-2.4830000400999999,-78.166999816900002]
["PTZ","Rio Amazonas Airport","EC",-1.5052399635,-78.062698364300005]
["SCY","San Cristobal Airport","EC",-0.91020601990000005,-89.617401122999993]
["BHA","Los Perales Airport","EC",-0.60811102390000005,-80.402702331499995]
["TSC","Taisha Airport","EC",-2.3816699982,-77.502799987800003]
["TPN","Tiputini Airport","EC",-0.77611100669999999,-75.526397705099996]
["LOH","Camilo Ponce Enriquez Airport","EC",-3.9958899021000001,-79.371902465800005]
["ESM","General Rivadeneira Airport","EC",0.9785190225,-79.626602172899993]
["TPC","Tarapoa Airport","EC",-0.12295600030000001,-76.337799072300001]
["TUA","Teniente Coronel Luis a Mantilla Airport","EC",0.80950599909999998,-77.708099365199999]
["PSY","Stanley Airport","FK",-51.685699462899997,-57.7775993347]
["ASU","Silvio Pettirossi International Airport","PY",-25.239999771099999,-57.520000457800002]
["AYO","Juan De Ayolas Airport","PY",-27.370000839199999,-56.849998474099998]
["BFA","Bahia Negra Airport","PY",-20.224599838300001,-58.179199218800001]
["CIO","Teniente Col Carmelo Peralta Airport","PY",-23.440000534100001,-57.430000305199997]
["ENO","Encarnacion Airport","PY",-27.2999992371,-55.909999847400002]
["AGT","Guarani International Airport","PY",-25.459999084500001,-54.840000152599998]
["FLM","Filadelfia Airport","PY",-22.3600006104,-60.049999237100003]
["ESG","Dr. Luis Maria Argana International Airport","PY",-22.0499992371,-60.6199989319]
["OLK","Fuerte Olimpo Airport","PY",-21.0452003479,-57.882499694800003]
["PIL","Carlos Miguel Gimenez Airport","PY",-26.879999160800001,-58.319999694800003]
["PJC","Dr Augusto Roberto Fuster International Airport","PY",-22.6399993896,-55.830001831099999]
["MSI","Fazenda Palmital Airport","BR",-20.696399688700001,-48.286399841300003]
["LVR","Municipal Bom Futuro Airport","BR",-13.0378611111,-55.950249999999997]
["FRC","Franca Airport","BR",-20.592199325599999,-47.382900237999998]
["JUA","Juara Sul Airport","BR",-11.286666870099999,-57.538890838599997]
["CFO","Confresa Airport","BR",-10.6344003677,-51.563598632800002]
["NPR","Novo Progresso Airport","BR",-7.1258330345000003,-55.400833129900001]
["RIG","Rio Grande Airport","BR",-32.081699,-52.163299000000002]
["ACR","Araracuara Airport","CO",-0.58330000000000004,-72.408299999999997]
["ACD","Alcides Fernandez Airport","CO",8.5166699999999995,-77.3]
["HAY","Aguachica Airport","CO",8.3000000000000007,-73.630600000000001]
["AFI","Amalfi Airport","CO",6.9166699999999999,-75.066699999999997]
["ADN","Andes Airport","CO",5.6666699999999999,-75.883300000000006]
["API","Gomez Nino Apiay Air Base","CO",4.0760699999999996,-73.562700000000007]
["AXM","El Eden Airport","CO",4.4527799999999997,-75.766400000000004]
["PUU","Tres De Mayo Airport","CO",0.50522800000000001,-76.500799999999998]
["ELB","Las Flores Airport","CO",9.0455400000000008,-73.974900000000005]
["BGA","Palonegro Airport","CO",7.1265000000000001,-73.184799999999996]
["BOG","El Dorado International Airport","CO",4.7015900000000004,-74.146900000000002]
["BAQ","Ernesto Cortissoz International Airport","CO",10.8896,-74.780799999999999]
["BSC","Jose Celestino Mutis Airport","CO",6.2029199999999998,-77.3947]
["BUN","Gerardo Tobar Lopez Airport","CO",3.8196300000000001,-76.989800000000002]
["CPB","Capurgana Airport","CO",8.6333300000000008,-77.349999999999994]
["CUC","Camilo Daza International Airport","CO",7.9275700000000002,-72.511499999999998]
["COG","Mandinga Airport","CO",5.0833300000000001,-76.7]
["CTG","Rafael Nunez International Airport","CO",10.442399999999999,-75.513000000000005]
["CCO","Carimagua Airport","CO",4.5641699999999998,-71.336399999999998]
["CLO","Alfonso Bonilla Aragon International Airport","CO",3.5432199999999998,-76.381600000000006]
["CIM","Cimitarra Airport","CO",6.367,-73.966999999999999]
["RAV","Cravo Norte Airport","CO",6.31684,-70.210700000000003]
["TCO","La Florida Airport","CO",1.8144199999999999,-78.749200000000002]
["BHF","Cupica Airport","CO",6.6919440000000003,-77.477221999999998]
["CUO","Caruru Airport","CO",1.0136000000000001,-71.296099999999996]
["CAQ","Juan H White Airport","CO",7.9684699999999999,-75.198499999999996]
["CVE","Covenas Airport","CO",9.4009199999999993,-75.691299999999998]
["CZU","Las Brujas Airport","CO",9.3327399999999994,-75.285600000000002]
["EBG","El Bagre Airport","CO",7.5964700000000001,-74.808899999999994]
["EJA","Yariguies Airport","CO",7.02433,-73.806799999999996]
["FLA","Gustavo Artunduaga Paredes Airport","CO",1.5891900000000001,-75.564400000000006]
["FDA","Fundacion Airport","CO",10.533300000000001,-74.2]
["LGT","La Gaviota Airport","CO",4.549722,-70.924999999999997]
["GIR","Santiago Vila Airport","CO",4.2762399999999996,-74.796700000000001]
["CRC","Santa Ana Airport","CO",4.7581800000000003,-75.955699999999993]
["GPI","Juan Casiano Airport","CO",2.5701299999999998,-77.898600000000002]
["GLJ","Garzon La Jagua Airport","CO",2.1463999999999999,-75.694400000000002]
["CPL","Chaparral Airport","CO",3.7170000000000001,-75.466999999999999]
["HTZ","Hato Corozal Airport","CO",6.15,-71.75]
["IBE","Perales Airport","CO",4.4216100000000003,-75.133300000000006]
["IGO","Chigorodo Airport","CO",7.6803800000000004,-76.686499999999995]
["MMP","San Bernardo Airport","CO",9.2587200000000003,-74.438000000000002]
["IPI","San Luis Airport","CO",0.86192500000000005,-77.671800000000005]
["APO","Antonio Roldan Betancourt Airport","CO",7.81196,-76.716399999999993]
["LQM","Caucaya Airport","CO",-0.182278,-74.770799999999994]
["MCJ","Jorge Isaac Airport","CO",11.2325,-72.490099999999998]
["LPD","La Pedrera Airport","CO",-1.3286100000000001,-69.579700000000003]
["LET","Alfredo Vasquez Cobo International Airport","CO",-4.1935500000000001,-69.943200000000004]
["EOH","Enrique Olaya Herrera Airport","CO",6.2205490000000001,-75.590581999999998]
["MFS","Miraflores Airport","CO",1.35,-71.944400000000002]
["MGN","Baracoa Airport","CO",9.2847399999999993,-74.846100000000007]
["MTB","Montelibano Airport","CO",7.9717399999999996,-75.432500000000005]
["MTR","Los Garzones Airport","CO",8.8237400000000008,-75.825800000000001]
["MVP","Fabio Alberto Leon Bentley Airport","CO",1.25366,-70.233900000000006]
["MZL","La Nubia Airport","CO",5.0296000000000003,-75.464699999999993]
["NCI","Necocli Airport","CO",8.4499999999999993,-76.783299999999997]
["NQU","Reyes Murillo Airport","CO",5.6963999999999997,-77.280600000000007]
["NVA","Benito Salas Airport","CO",2.9501499999999998,-75.293999999999997]
["OCV","Aguas Claras Airport","CO",8.3150600000000008,-73.3583]
["ORC","Orocue Airport","CO",4.7922200000000004,-71.356399999999994]
["OTU","Otu Airport","CO",7.01037,-74.715500000000006]
["RON","Juan Jose Rondon Airport","CO",5.7645400000000002,-73.105400000000003]
["PCR","German Olano Airport","CO",6.1847200000000004,-67.493200000000002]
["PDA","Obando Airport","CO",3.8535300000000001,-67.906199999999998]
["PEI","Matecana International Airport","CO",4.8126699999999998,-75.739500000000007]
["PTX","Pitalito Airport","CO",1.8577699999999999,-76.085700000000003]
["PLT","Plato Airport","CO",9.8000000000000007,-74.783299999999997]
["NAR","Puerto Nare Airport","CO",6.2100200000000001,-74.590599999999995]
["PPN","Guillermo Leon Valencia Airport","CO",2.4544000000000001,-76.609300000000005]
["PQE","German Olano Air Base","CO",5.4836099999999997,-74.657399999999996]
["PBE","Puerto Berrio Airport","CO",6.4603400000000004,-74.410499999999999]
["PSO","Antonio Narino Airport","CO",1.39625,-77.291499999999999]
["PVA","El Embrujo Airport","CO",13.3569,-81.3583]
["PZA","Paz De Ariporo Airport","CO",5.87615,-71.886600000000001]
["MQU","Jose Celestino Mutis Airport","CO",5.2125599999999999,-74.883600000000001]
["MDE","Jose Maria Cordova International Airport","CO",6.1645399999999997,-75.423100000000005]
["RCH","Almirante Padilla Airport","CO",11.526199999999999,-72.926000000000002]
["RVE","Los Colonizadores Airport","CO",6.9513889999999998,-71.856943999999999]
["SJE","Jorge E. Gonzalez Torres Airport","CO",2.5796899999999998,-72.639399999999995]
["SMR","Simon Bolivar International Airport","CO",11.1196,-74.230599999999995]
["SOX","Alberto Lleras Camargo Airport","CO",5.6773199999999999,-72.970299999999995]
["ADZ","Gustavo Rojas Pinilla International Airport","CO",12.583600000000001,-81.711200000000005]
["SVI","Eduardo Falla Solano Airport","CO",2.1521699999999999,-74.766300000000001]
["TAU","Tauramena Airport","CO",5.01281,-72.742400000000004]
["TIB","Tibu Airport","CO",8.6315200000000001,-72.730400000000003]
["TDA","Trinidad Airport","CO",5.4327800000000002,-71.662499999999994]
["TLU","Tolu Airport","CO",9.5094499999999993,-75.585400000000007]
["TME","Gustavo Vargas Airport","CO",6.4510800000000001,-71.760300000000001]
["TQS","Tres Esquinas Air Base","CO",0.74590000000000001,-75.233999999999995]
["TRB","Gonzalo Mejia Airport","CO",8.0745299999999993,-76.741500000000002]
["AUC","Santiago Perez Airport","CO",7.0688800000000001,-70.736900000000006]
["UIB","El Carano Airport","CO",5.69076,-76.641199999999998]
["ULQ","Farfan Airport","CO",4.0883599999999998,-76.235100000000003]
["URR","Urrao Airport","CO",6.32883,-76.142499999999998]
["VGZ","Villa Garzon Airport","CO",0.98194400000000004,-76.604167000000004]
["PYA","Velasquez Airport","CO",5.9390400000000003,-74.456999999999994]
["VUP","Alfonso Lopez Pumarejo Airport","CO",10.435,-73.249499999999998]
["VVC","Vanguardia Airport","CO",4.1678699999999997,-73.613799999999998]
["AYG","Yaguara Airport","CO",1.54417,-73.933300000000003]
["EYP","El Yopal Airport","CO",5.3191100000000002,-72.384]
["MHW","Monteagudo Airport","BO",-19.826999664300001,-63.960998535199998]
["SRE","Juana Azurduy De Padilla Airport","BO",-19.007099151599999,-65.288696289100002]
["APB","Apolo Airport","BO",-14.7356004715,-68.411903381299993]
["ASC","Ascencion De Guarayos Airport","BO",-15.9302997589,-63.156700134300003]
["BVL","Baures Airport","BO",-13.583333015399999,-63.5833320618]
["BJO","Bermejo Airport","BO",-22.773300170900001,-64.312896728499993]
["CAM","Camiri Airport","BO",-20.006399154699999,-63.527801513699998]
["CBB","Jorge Wilsterman International Airport","BO",-17.421100616499999,-66.177101135300006]
["CIJ","Capitan Anibal Arab Airport","BO",-11.0403995514,-68.782997131299993]
["CEP","Concepcion Airport","BO",-16.138299942,-62.0285987854]
["SRZ","El Trompillo Airport","BO",-17.811599731400001,-63.1715011597]
["GYA","Capitan de Av. Emilio Beltran Airport","BO",-10.820599555999999,-65.345596313499996]
["BVK","Huacaraje Airport","BO",-13.550000190700001,-63.747898101799997]
["SJS","San Jose De Chiquitos Airport","BO",-17.8307991028,-60.743099212600001]
["SJB","San Joaquin Airport","BO",-13.0528001785,-64.661697387700002]
["SJV","San Javier Airport","BO",-16.2707996368,-62.470298767099997]
["LPB","El Alto International Airport","BO",-16.513299942,-68.192298889200003]
["MGD","Magdalena Airport","BO",-13.260748376700001,-64.060764312700002]
["ORU","Juan Mendoza Airport","BO",-17.962600708,-67.076202392599996]
["POI","Capitan Nicolas Rojas Airport","BO",-19.543100357099998,-65.723701477099993]
["PUR","Puerto Rico Airport","BO",-11.107663154600001,-67.5511550903]
["PSZ","Capitan Av. Salvador Ogaya G. airport","BO",-18.975299835200001,-57.820598602300002]
["SRD","San Ramon Airport","BO",-13.263899803199999,-64.603897094700002]
["RBO","Robore Airport","BO",-18.329200744600001,-59.7649993896]
["RIB","Capitan Av. Selin Zeitun Lopez Airport","BO",-11,-66]
["RBQ","Rurenabaque Airport","BO",-14.4279003143,-67.496803283700004]
["REY","Reyes Airport","BO",-14.304400444000001,-67.353401184099994]
["SBL","Santa Ana Del Yacuma Airport","BO",-13.762200355499999,-65.435203552199994]
["SRJ","Capitan Av. German Quiroga G. Airport","BO",-14.859199523899999,-66.737503051800005]
["SNG","Capitan Av. Juan Cochamanidis S. Airport","BO",-16.383600234999999,-60.962799072300001]
["SNM","San Ignacio de Moxos Airport","BO",-14,-65.633903503400006]
["SRB","Santa Rosa De Yacuma Airport","BO",-14.0662002563,-66.786796569800003]
["MQK","San Matias Airport","BO",-16.339199066199999,-58.401901245099999]
["TJA","Capitan Oriel Lea Plaza Airport","BO",-21.5557003021,-64.701301574699997]
["TDD","Teniente Av. Jorge Henrich Arauz Airport","BO",-14.8186998367,-64.917999267599996]
["UYU","Uyuni Airport","BO",-20.4463005066,-66.848396301299999]
["VAH","Capitan Av. Vidal Villagomez Toledo Airport","BO",-18.482500076299999,-64.099403381299993]
["VLM","Teniente Coronel Rafael Pabon Airport","BO",-21.255199432400001,-63.405601501500001]
["VVI","Viru Viru International Airport","BO",-17.644800186200001,-63.135398864700001]
["BYC","Yacuiba Airport","BO",-21.960899352999999,-63.651699066200003]
["ABN","Albina Airport","SR",5.5127201079999999,-54.050098419199998]
["BTO","Botopasi Airport","SR",4.2175110934999998,-55.447053909300003]
["AAJ","Cayana Airstrip","SR",3.8986809999999998,-55.577907000000003]
["TOT","Totness Airport","SR",5.8658299445999997,-56.3274993896]
["DRJ","Drietabbetje Airport","SR",4.1166667938000003,-54.666671752900001]
["DOE","Djumu-Djomoe Airport","SR",4.0057126105999998,-55.481643676799997]
["LDO","Ladouanie Airport","SR",4.3761082834999998,-55.407056808500002]
["PBM","Johan Adolf Pengel International Airport","SR",5.4528298378000004,-55.1878013611]
["MOJ","Moengo Airstrip","SR",5.6075999999999997,-54.400300000000001]
["ICK","Nieuw Nickerie Airport","SR",5.9555602073999996,-57.039398193399997]
["OEM","Vincent Fayks Airport","SR",3.345279932,-55.4425010681]
["SMZ","Stoelmanseiland Airport","SR",4.3499999045999997,-54.4166679382]
["KCB","Tepoe Airstrip","SR",3.1500000953999998,-55.716999053999999]
["AGI","Wageningen Airport Airport","SR",5.7666668891999997,-56.633331298800002]
["WSO","Washabo Airport","SR",5.2501502036999996,-57.173801422099999]
["ORG","Zorg en Hoop Airport","SR",5.8110799788999996,-55.190700530999997]
["JAW","Araripina Airport","BR",-7.5867600441,-40.535499572799999]
["APY","Alto Parnaiba Airport","BR",-9.0836105347,-45.950557708700003]
["APQ","Arapiraca Airport","BR",-9.7753601073999992,-36.629199981699998]
["AMJ","Cirilo Queiroz Airport","BR",-16.183890000000002,-40.66722]
["BDC","Barra do Corda Airport","BR",-5.5025000000000004,-45.215833000000003]
["BVM","Belmonte Airport","BR",-15.871700286899999,-38.871898651099997]
["BRA","Barreiras Airport","BR",-12.0789003372,-45.008998870799999]
["BSS","Balsas Airport","BR",-7.5260300636000004,-46.053298950200002]
["BMS","Socrates Mariani Bittencourt Airport","BR",-14.255399704,-41.8175010681]
["BQQ","Barra Airport","BR",-11.080800056499999,-43.147499084499998]
["CTP","Carutapera Airport","BR",-1.2502779960999999,-46.017223358199999]
["CPU","Cururupu Airport","BR",-1.8211109999999999,-44.866943999999997]
["QCH","Colatina Airport","BR",-19.486999511699999,-40.579399108899999]
["RDC","Redencao Airport","BR",-8.0332899094000005,-49.979900360099997]
["LEP","Leopoldina Airport","BR",-21.4661006927,-42.727001190199999]
["DTI","Diamantina Airport","BR",-18.232000351,-43.650398254400002]
["DIQ","Divinopolis Airport","BR",-20.1807003021,-44.870899200399997]
["CNV","Canavieiras Airport","BR",-15.666999816900001,-38.954700469999999]
["SXX","Sao Felix do Xingu Airport","BR",-6.6402778624999996,-51.990001678500001]
["GUZ","Guarapari Airport","BR",-20.646499633800001,-40.491901397699998]
["GDP","Guadalupe Airport","BR",-6.7822198868000001,-43.582199096700002]
["GNM","Guanambi Airport","BR",-14.2082004547,-42.746101379400002]
["GMS","Fazenda Canada Airport","BR",-18.8624992371,-48.415279388400002]
["QGP","Garanhuns Airport","BR",-8.8342800140000008,-36.471599578899998]
["IRE","Irece Airport","BR",-11.3399000168,-41.847000122099999]
["QIG","Iguatu Airport","BR",-6.3466401100000001,-39.293800353999998]
["QIT","Itapetinga Airport","BR",-15.244500160199999,-40.277198791499998]
["IPU","Ipiau Airport","BR",-14.1338891983,-39.7338905334]
["JCM","Jacobina Airport","BR",-11.163200378399999,-40.553100585899998]
["FEC","Joao Durval Carneiro Airport","BR",-12.200300216700001,-38.906799316399997]
["JEQ","Jequie Airport","BR",-13.877699851999999,-40.071601867699997]
["JNA","Januaria Airport","BR",-15.473799705499999,-44.385501861599998]
["JDR","Prefeito Octavio de Almeida Neves Airport","BR",-21.084999084500001,-44.224723815899999]
["CMP","Santana do Araguaia Airport","BR",-9.3199701308999998,-50.3284988403]
["QDF","Conselheiro Lafaiete Airport","BR",-20.738599777200001,-43.797401428199997]
["CDI","Cachoeiro do Itapemirim Airport","BR",-20.8342990875,-41.185600280800003]
["QCP","Currais Novos Airport","BR",-6.2808327674999997,-36.540279388400002]
["LVB","Estancia Portal do Sol Airport","BR",-22.165278000000001,-47.892778]
["SSO","Sao Lourenco Airport","BR",-22.090900421099999,-45.044498443599998]
["MTE","Monte Alegre Airport","BR",-1.9958000183,-54.074199676500001]
["MVS","Mucuri Airport","BR",-18.0489006042,-39.864200592000003]
["SBJ","Sao Mateus Airport","BR",-18.721300125100001,-39.833698272699998]
["PTQ","Porto de Moz Airport","BR",-1.7414499521,-52.236099243200002]
["NNU","Nanuque Airport","BR",-17.823299408,-40.329898834200002]
["QBX","Sobral Airport","BR",-3.6788899899,-40.336799621600001]
["PSW","Municipal Jose Figueiredo Airport","BR",-20.732200622600001,-46.661800384499998]
["FEJ","Feijo Airport","BR",-8.1655797957999994,-70.352996826199998]
["ORX","Oriximina Airport","BR",-1.7140799761000001,-55.836200714100002]
["PCS","Picos Airport","BR",-7.0620598792999996,-41.523700714100002]
["POJ","Patos de Minas Airport","BR",-18.672800064099999,-46.491199493400003]
["PIV","Pirapora Airport","BR",-17.316900253299998,-44.860298156699997]
["FLB","Cangapara Airport","BR",-6.8463897705000001,-43.077301025399997]
["PDF","Prado Airport","BR",-17.296699523899999,-39.271198272699998]
["CAU","Caruaru Airport","BR",-8.2823896408,-36.013500213599997]
["OPP","Salinopolis Airport","BR",-0.69566398860000001,-47.334701538099999]
["SFK","Soure Airport","BR",-0.69943100209999998,-48.5209999084]
["TXF","Teixeira de Freitas Airport","BR",-17.524499893200002,-39.668498992899998]
["OBI","Obidos Airport","BR",-1.8671699762,-55.514400482200003]
["TFL","Juscelino Kubitscheck Airport","BR",-17.8922996521,-41.5135993958]
["VAL","Valenca Airport","BR",-13.296500205999999,-38.992401123]
["QID","Melio Viana Airport","BR",-21.790599823000001,-45.269199371299997]
["BVS","Breves Airport","BR",-1.6365300416999999,-50.443599700900002]
["CMC","Camocim Airport","BR",-2.8961799144999998,-40.858001709]
["QXC","Fazenda Sao Braz Airport","BR",-9.3752775192000009,-35.5416679382]
["GGF","Almeirim Airport","BR",-1.4919439554,-52.578334808299999]
["PHI","Pinheiro Airport","BR",-2.4836111069000002,-45.067222595200001]
["ITI","Agropecuaria Castanhais Airport","BR",-8.6999998092999995,-51.174167633099998]
["PPY","Pouso Alegre Airport","BR",-22.289199829099999,-45.919101715099998]
["ITE","Itubera Airport","BR",-13.732221603399999,-39.141666412399999]
["CAY","Cayenne-Rochambeau Airport","GF",4.8198099136000003,-52.360401153600002]
["GSI","Grand-Santi Airport","GF",4.2858333333000003,-54.373055555599997]
["MPY","Maripasoula Airport","GF",3.6575000285999999,-54.037200927699999]
["OXP","Saint-Georges-de-l'Oyapock Airport","GF",3.8975999355000002,-51.804100036599998]
["LDX","Saint-Laurent-du-Maroni Airport","GF",5.4830598831000001,-54.034400939900003]
["REI","Regina Airport","GF",4.3147201537999997,-52.131698608400001]
["XAU","Saul Airport","GF",3.6136100292000002,-53.204200744600001]
["APE","San Juan Aposento Airport","PE",-15.353899955699999,-75.167098999000004]
["ALD","Alerta Airport","PE",-11.6829996109,-69.333000183099998]
["AOP","Alferez FAP Alfredo Vladimir Sara Bauer Airport","PE",-2.7961299418999999,-76.466598510699995]
["ATG","Teniente General Gerardo Perez Pinedo Airport","PE",-10.7291002274,-73.766502380399999]
["MBP","Moyobamba Airport","PE",-6.0188889503,-76.9883270264]
["BLP","Huallaga Airport","PE",-7.0605602263999998,-76.582199096699995]
["IBP","Iberia Airport","PE",-11.4116001129,-69.4887008667]
["PCL","Cap FAP David Abenzur Rengifo International Airport","PE",-8.3779401778999993,-74.574302673299997]
["TDP","Trompeteros Airport","PE",-3.8060100078999999,-75.039299011200001]
["CHM","Teniente FAP Jaime A De Montreuil Morales Airport","PE",-9.1496095657000005,-78.523803710899998]
["TGI","Tingo Maria Airport","PE",-9.1330003737999998,-75.949996948199995]
["CIX","Capitan FAP Jose A Quinones Gonzales International Airport","PE",-6.7874798775,-79.828102111800007]
["AYP","Coronel FAP Alfredo Mendivil Duarte Airport","PE",-13.154800415,-74.204399108900006]
["ANS","Andahuaylas Airport","PE",-13.706399917600001,-73.350402832]
["ATA","Comandante FAP German Arias Graziani Airport","PE",-9.3474397659000008,-77.598396301299999]
["UMI","Quince Air Base","PE",-13.233300208999999,-70.7533035278]
["UCZ","Uchiza Airport","PE",-8.4670000075999994,-76.349998474100005]
["RIJ","Juan Simons Vela Airport","PE",-6.0678601265000003,-77.160003662099996]
["LIM","Jorge Chavez International Airport","PE",-12.021900176999999,-77.1143035889]
["JAE","Shumba Airport","PE",-5.5924801826000001,-78.774002075200002]
["JJI","Juanjui Airport","PE",-7.1690998077000003,-76.728599548299997]
["JAU","Francisco Carle Airport","PE",-11.783100128199999,-75.473396301299999]
["JUL","Inca Manco Capac International Airport","PE",-15.4671001434,-70.158203125]
["SJA","San Juan de Marcona Airport","PE",-15.3524999619,-75.137199401900006]
["CJA","Mayor General FAP Armando Revoredo Iglesias Airport","PE",-7.1391801833999997,-78.489402771000002]
["RIM","San Nicolas Airport","PE",-6.3923101425000004,-77.501197814899996]
["ILQ","Ilo Airport","PE",-17.6949996948,-71.344001770000006]
["TBP","Capitan FAP Pedro Canga Rodriguez Airport","PE",-3.5525300503000001,-80.381401061999995]
["MZA","Manuel Prado Ugarteche Airport","PE",-11.325400352500001,-74.535598754899993]
["SMG","Santa Maria Airport","PE",-11.983333587600001,-77]
["YMS","Moises Benzaquen Rengifo Airport","PE",-5.8937702179000002,-76.118202209499998]
["HUU","Alferez Fap David Figueroa Fernandini Airport","PE",-9.8788099289000009,-76.204803466800001]
["SQU","Saposoa Airport","PE",-6.9600300789,-76.768402099599996]
["CHH","Chachapoyas Airport","PE",-6.2018098831000001,-77.856101989699994]
["REQ","Requena Airport","PE",-5.0669999123,-73.866996765099998]
["IQT","Coronel FAP Francisco Secada Vignetta International Airport","PE",-3.7847399712000001,-73.308799743700007]
["AQP","Rodriguez Ballon International Airport","PE",-16.3411006927,-71.583099365199999]
["TRU","Capitan FAP Carlos Martinez De Pinillos International Airport","PE",-8.081410408,-79.108802795399995]
["SQD","San Francisco Airport","PE",-6.6166801453000001,-77.766700744600001]
["PIO","Capitan FAP Renan Elias Olivera International Airport","PE",-13.7448997498,-76.220298767100005]
["TPP","Cadete FAP Guillermo Del Castillo Paredes Airport","PE",-6.5087399482999997,-76.373199462900004]
["SYC","Shiringayoc Airport","PE",-11.8832998276,-69.199996948199995]
["TCQ","Coronel FAP Carlos Ciriani Santa Rosa International Airport","PE",-18.053300857499998,-70.275802612299998]
["PEM","Padre Aldamiz International Airport","PE",-12.613599777199999,-69.228599548299997]
["PIU","Capitan FAP Guillermo Concha Iberico International Airport","PE",-5.2057499886,-80.616401672400002]
["TYL","Capitan Montes Airport","PE",-4.5766401291000003,-81.254096984900002]
["CUZ","Alejandro Velasco Astete International Airport","PE",-13.5356998444,-71.938796997099999]
["APU","Apucarana Airport","BR",-23.609500884999999,-51.384498596199997]
["BGV","Aeroclube de Bento Goncalves Airport","BR",-29.148332595799999,-51.5363883972]
["BNU","Blumenau Airport","BR",-26.830600738499999,-49.090301513699998]
["CCI","Concordia Airport","BR",-27.180599212600001,-52.052700042700003]
["CSS","Cassilandia Airport","BR",-19.1463890076,-51.685279846199997]
["QCN","Canela Airport","BR",-29.3701992035,-50.832000732399997]
["CKO","Cornelio Procopio Airport","BR",-23.152500152599998,-50.602500915500002]
["GGH","Cianorte Airport","BR",-23.6914997101,-52.641899108899999]
["DOU","Dourados Airport","BR",-22.201900482199999,-54.926601409900002]
["ERM","Erechim Airport","BR",-27.661899566700001,-52.2682991028]
["FBE","Francisco Beltrao Airport","BR",-26.059200286900001,-53.0634994507]
["QGA","Guaira Airport","BR",-24.0811004639,-54.191699981699998]
["HRZ","Horizontina Airport","BR",-27.638299942,-54.339099883999999]
["IJU","Ijui Airport","BR",-28.368700027500001,-53.846599578899998]
["ITQ","Itaqui Airport","BR",-29.173099517800001,-56.536701202400003]
["JCB","Santa Terezinha Airport","BR",-27.171400070200001,-51.553298950200002]
["CBW","Campo Mourao Airport","BR",-24.009199142500002,-52.356800079300001]
["QDB","Cachoeira do Sul Airport","BR",-30.001899719200001,-52.940799713099999]
["QCR","Curitibanos Airport","BR",-27.282499313399999,-50.6114006042]
["OAL","Cacoal Airport","BR",-11.493611,-61.175556]
["LOI","Helmuth Baungarten Airport","BR",-27.159999847400002,-49.542499542199998]
["ALQ","Alegrete Novo Airport","BR",-29.812700271600001,-55.893398284900002]
["QMF","Mafra Airport","BR",-26.1588993073,-49.832199096700002]
["QGF","Montenegro Airport","BR",-29.7194004059,-51.489398956300001]
["QHV","Novo Hamburgo Airport","BR",-29.696100234999999,-51.081699371299997]
["SQX","Sao Miguel do Oeste Airport","BR",-26.7816009521,-53.503501892099997]
["APX","Arapongas Airport","BR",-23.3528995514,-51.491699218800001]
["VRZ","Lavras Airport","BR",-21.240600585900001,-44.963901519799997]
["AIR","Aripuana Airport","BR",-10.250277519200001,-59.383888244600001]
["PTO","Pato Branco Airport","BR",-26.217800140400001,-52.694301605200003]
["PNG","Paranagua Airport","BR",-25.540100097700002,-48.531200408899998]
["PVI","Paranavai Airport","BR",-23.089899063099999,-52.488498687700002]
["PBB","Paranaiba Airport","BR",-19.651199340800002,-51.1994018555]
["QAC","Castro Airport","BR",-24.807500839199999,-49.960300445599998]
["SQY","Sao Lourenco do Sul Airport","BR",-31.383300781300001,-52.032798767099997]
["QOJ","Sao Borja Airport","BR",-28.6548995972,-56.0345993042]
["CSU","Santa Cruz do Sul Airport","BR",-29.684099197399998,-52.412200927699999]
["UMU","Umuarama Airport","BR",-23.798700332599999,-53.3138008118]
["QVB","Uniao da Vitoria Airport","BR",-26.2334003448,-51.067798614499999]
["VIA","Videira Airport","BR",-26.999700546300001,-51.141899108899999]
["CTQ","Santa Vitoria do Palmar Airport","BR",-33.502223968499997,-53.344165801999999]
["AXE","Xanxere Airport","BR",-26.8755569458,-52.373054504400002]
["AAG","Arapoti Airport","BR",-24.1039009094,-49.789100646999998]
["SRA","Santa Rosa Airport","BR",-27.906700134299999,-54.520401001000003]
["PGZ","Ponta Grossa Airport","BR",-25.1847000122,-50.144100189200003]
["ATI","Artigas International Airport","UY",-30.400699615499999,-56.507900237999998]
["CYR","Laguna de Los Patos International Airport","UY",-34.456401825,-57.770599365199999]
["DZO","Santa Bernardina International Airport","UY",-33.358898162800003,-56.499198913599997]
["PDP","Capitan Corbeta CA Curbelo International Airport","UY",-34.855098724400001,-55.094299316399997]
["MLZ","Cerro Largo International Airport","UY",-32.337898254400002,-54.2167015076]
["MVD","Carrasco International /General C L Berisso Airport","UY",-34.838401794399999,-56.030799865699997]
["PDU","Tydeo Larre Borges Airport","UY",-32.363300323499999,-58.061901092500001]
["RVY","Presidente General Don Oscar D. Gestido International Airport","UY",-30.974599838300001,-55.476200103799997]
["STY","Nueva Hesperides International Airport","UY",-31.4384994507,-57.985298156699997]
["TAW","Tacuarembo Airport","UY",-31.7490005493,-55.925800323499999]
["TYT","Treinta y Tres Airport","UY",-33.200000762899997,-54.349998474099998]
["VCH","Vichadero Airport","UY",-31.767000198400002,-54.617000579799999]
["AGV","Oswaldo Guevara Mujica Airport","VE",9.5533752440999997,-69.237869262700002]
["AAO","Anaco Airport","VE",9.4302253723000007,-64.470726013199993]
["LPJ","Armando Schwarck Airport","VE",6.5780501365999999,-66.816902160599994]
["BLA","General Jose Antonio Anzoategui International Airport","VE",10.1070995331,-64.689201354999994]
["BNS","Barinas Airport","VE",8.6195697784000007,-70.220802307100001]
["BRM","Barquisimeto International Airport","VE",10.0427465439,-69.358619689899996]
["MYC","Escuela Mariscal Sucre Airport","VE",10.249978065500001,-67.649421691900002]
["CBL","Ciudad Bolivar Airport","VE",8.1221609116,-63.536956787100003]
["CXA","Caicara del Orinoco Airport","VE",7.6255102158000003,-66.162803649899999]
["CUV","Casigua El Cubo Airport","VE",8.7581396103000007,-72.536300659199995]
["CLZ","Calabozo Airport","VE",8.9246559143000006,-67.417091369600001]
["CAJ","Canaima Airport","VE",6.2319889068999998,-62.854431152300002]
["VCR","Carora Airport","VE",10.175602912900001,-70.065216064500007]
["CUP","General Francisco Bermudez Airport","VE",10.660014152500001,-63.261680603000002]
["CZE","Jose Leonardo Chirinos Airport","VE",11.4149436951,-69.680900573700001]
["CUM","Cumana (Antonio Jose de Sucre) Airport","VE",10.450332641599999,-64.130470275899995]
["isl","La Tortuga Punta Delgada Airport","VE",10.936667442299999,-65.223335266099994]
["EOR","El Dorado Airport","VE",6.7333331108000003,-61.5833320618]
["EOZ","Elorza Airport","VE",7.0833330154,-69.533332824699997]
["GDO","Guasdalito Airport","VE",7.2333331108000003,-70.800003051800005]
["GUI","Guiria Airport","VE",10.574077606199999,-62.312667846700002]
["GUQ","Guanare Airport","VE",9.0269441604999994,-69.755149841299996]
["HGE","Higuerote Airport","VE",10.4624528885,-66.092758178699995]
["ICA","Icabaru Airport","VE",4.3363199233999996,-61.739601135299999]
["ICC","Andres Miguel Salazar Marcano Airport","VE",10.794405937200001,-63.981590271000002]
["LSP","Josefa Camejo International Airport","VE",11.780775070200001,-70.151496887199997]
["KAV","Kavanayen Airport","VE",5.6329998970000004,-61.783000946000001]
["LFR","La Fria Airport","VE",8.2391672134,-72.271026611300002]
["MAR","La Chinita International Airport","VE",10.5582084656,-71.727859497099999]
["MRD","Alberto Carnevalli Airport","VE",8.5820779799999993,-71.161041259800001]
["PMV","Del Caribe Santiago Marino International Airport","VE",10.9126033783,-63.966598510700003]
["CCS","Maiquetia (Simon Bolivar Internacional) Airport","VE",10.6031169891,-66.990585327100007]
["MUN","Maturin Airport","VE",9.7545299530000005,-63.147399902300002]
["CBS","Oro Negro Airport","VE",10.330699920700001,-71.322502136200001]
["PYH","Cacique Aramare Airport","VE",5.6199898719999997,-67.606101989699994]
["PBL","General Bartolome Salom International Airport","VE",10.4805002213,-68.072998046899997]
["PDZ","Pedernales Airport","VE",9.9792404174999998,-62.228599548299997]
["PPH","Perai Tepuy Airport","VE",4.5666670799000002,-61.483333587600001]
["SCI","Paramillo Airport","VE",7.8013200759999997,-72.202903747600004]
["PZO","General Manuel Carlos Piar International Airport","VE",8.2885303497000002,-62.760398864700001]
["PTM","Palmarito Airport","VE",7.5666699408999998,-70.183296203599994]
["LRV","Gran Roque Airport","VE",11.949999809299999,-66.669998168899994]
["SVZ","San Antonio Del Tachira Airport","VE",7.8408298492000004,-72.439697265600003]
["SBB","Santa Barbara de Barinas Airport","VE",7.8035140038000002,-71.165718078599994]
["SNV","Santa Elena de Uairen Airport","VE",4.5549998282999997,-61.150001525900002]
["STD","Mayor Buenaventura Vivas International Airport","VE",7.5653800964000002,-72.035102844199997]
["SNF","Sub Teniente Nestor Arias Airport","VE",10.278699874899999,-68.755203247099999]
["SFD","San Fernando De Apure Airport","VE",7.8833198546999999,-67.444000244099996]
["SOM","San Tome Airport","VE",8.9451465606999996,-64.151084899899999]
["STB","Santa Barbara del Zulia Airport","VE",8.9745502471999998,-71.943252563499996]
["TUV","Tucupita Airport","VE",9.0889940262,-62.094173431400002]
["TMO","Tumeremo Airport","VE",7.25,-61.433334350599999]
["URM","Uriman Airport","VE",5.3333330154,-62.766666412399999]
["VLN","Arturo Michelena International Airport","VE",10.149732589699999,-67.928398132300003]
["VIG","Juan Pablo Perez Alfonso Airport","VE",8.6241388320999999,-71.672668457]
["VLV","Dr. Antonio Nicolas Briceno Airport","VE",9.3404779433999998,-70.584060668899994]
["VDP","Valle de La Pascua Airport","VE",9.2220277785999993,-65.9935836792]
["BAZ","Barcelos Airport","BR",-0.98129200940000005,-62.919601440400001]
["RBB","Borba Airport","BR",-4.4063401221999996,-59.602401733400001]
["CAF","Carauari Airport","BR",-4.8715200424000002,-66.897499084499998]
["CQS","Costa Marques Airport","BR",-12.4210996628,-64.251602172899993]
["DMT","Diamantino Airport","BR",-14.376899719200001,-56.400398254400002]
["DNO","Dianopolis Airport","BR",-11.5953998566,-46.846698760999999]
["ARS","Estancia das Cascatas Airport","BR",-15.8966999054,-52.095600128199997]
["ERN","Eirunepe Airport","BR",-6.6395301818999997,-69.879798889200003]
["CQA","Canarana Airport","BR",-13.574443817100001,-52.270557403600002]
["SXO","Sao Felix do Araguaia Airport","BR",-11.632399559,-50.689601898200003]
["GRP","Gurupi Airport","BR",-11.7396001816,-49.132198333700003]
["AUX","Araguaina Airport","BR",-7.2278699875000001,-48.240501403800003]
["GGB","Fazenda Olhos D`agua Airport","BR",-14.019444465599999,-52.152221679699998]
["HUW","Humaita Airport","BR",-7.5321202278000001,-63.072101592999999]
["IPG","Ipiranga Airport","BR",-2.9390699862999998,-69.694000244099996]
["IDO","Santa Izabel do Morro Airport","BR",-11.5722999573,-50.6661987305]
["JPR","Ji-Parana Airport","BR",-10.870800018300001,-61.846500396700002]
["JIA","Juina Airport","BR",-11.4194440842,-58.701667785600002]
["JRN","Juruena Airport","BR",-10.305832862899999,-58.489444732700001]
["JTI","Jatai Airport","BR",-17.829900741599999,-51.772998809800001]
["CCX","Caceres Airport","BR",-16.043600082400001,-57.629901885999999]
["CIZ","Coari Airport","BR",-4.1340599060000001,-63.132598877]
["NSR","Serra da Capivara Airport","BR",-9.0827779999999994,-42.644444]
["TLZ","Catalao Airport","BR",-18.216800689700001,-47.899700164800002]
["LBR","Labrea Airport","BR",-7.2789697647000002,-64.769500732400004]
["RVD","General Leite de Castro Airport","BR",-17.834722518900001,-50.956111907999997]
["MBZ","Maues Airport","BR",-3.3721699715,-57.724800109900002]
["NVP","Novo Aripuana Airport","BR",-5.1180300712999998,-60.364898681600003]
["AQM","Nova Vida Airport","BR",-10.1780557632,-62.825557708700003]
["BCR","Novo Campo Airport","BR",-8.8345603943000004,-67.312400817899999]
["NQL","Niquelandia Airport","BR",-14.434900283799999,-48.491500854500003]
["APS","Anapolis Airport","BR",-16.362300872799999,-48.927101135299999]
["FBA","Fonte Boa Airport","BR",-2.5326099395999999,-66.083198547400002]
["PIN","Parintins Airport","BR",-2.6730198860000001,-56.777198791499998]
["PBQ","Pimenta Bueno Airport","BR",-11.6415996552,-61.179100036599998]
["PBX","Fazenda Piraguassu Airport","BR",-10.8611106873,-51.685001373299997]
["AAI","Arraias Airport","BR",-13.023888588,-46.885555267299999]
["ROO","Rondonopolis Airport","BR",-16.586000442500001,-54.724800109900002]
["OPS","Presidente Joao Batista Figueiredo Airport","BR",-11.885000228899999,-55.586109161400003]
["STZ","Santa Terezinha Airport","BR",-10.4647216797,-50.518611907999997]
["IRZ","Tapuruquara Airport","BR",-0.41694399710000002,-65.033889770499997]
["TGQ","Tangara da Serra Airport","BR",-14.661999702499999,-57.443500518800001]
["AZL","Fazenda Tucunare Airport","BR",-13.4655278136,-58.866934776299999]
["QHN","Taguatinga Airport","BR",-12.433889389000001,-46.400554657000001]
["SQM","Sao Miguel do Araguaia Airport","BR",-13.3312997818,-50.197601318399997]
["MTG","Vila Bela da Santissima Trindade Airport","BR",-15.0152778625,-59.967220306400002]
["VLP","Vila Rica Airport","BR",-9.9794435500999992,-51.142223358199999]
["MBK","Regional Orlando Villas Boas Airport","BR",-10.1702775955,-54.9527778625]
["NOK","Xavantina Airport","BR",-14.698300361599999,-52.3464012146]
["AHL","Aishalton Airport","GY",2.4865300655000002,-59.313400268599999]
["NAI","Annai Airport","GY",3.9594399929000001,-59.124198913599997]
["BCG","Bemichi Airport","GY",7.6999998093000004,-59.166660308799997]
["BMJ","Baramita Airport","GY",7.3701200484999996,-60.487998962399999]
["GFO","Bartica A Airport","GY",6.3747701645000001,-58.638099670400003]
["GEO","Cheddi Jagan International Airport","GY",6.4985499382,-58.254100799600003]
["OGL","Ogle Airport","GY",6.8062801360999998,-58.105899810799997]
["IMB","Imbaimadai Airport","GY",5.7081098557000001,-60.2942008972]
["KAR","Kamarang Airport","GY",5.8653402328000004,-60.614200592000003]
["KRM","Karanambo Airport","GY",3.7519400119999999,-59.309700012199997]
["KRG","Karasabai Airport","GY",4.0333299637,-59.5332984924]
["KTO","Kato Airport","GY",4.6491599082999997,-59.832199096700002]
["LUB","Lumid Pau Airport","GY",2.3939299583000002,-59.441001892099997]
["LTM","Lethem Airport","GY",3.3727600573999998,-59.789398193399997]
["USI","Mabaruma Airport","GY",8.1999998092999995,-59.7832984924]
["MHA","Mahdia Airport","GY",5.2774901390000002,-59.151100158699997]
["MYM","Monkey Mountain Airport","GY",4.4833297729000003,-59.683300018300002]
["MWJ","Matthews Ridge Airport","GY",7.4881120000000001,-60.184776999999997]
["QSX","New Amsterdam Airport","GY",6.2443239999999998,-57.474172000000003]
["ORJ","Orinduik Airport","GY",4.7252697945,-60.034999847400002]
["PRR","Paruma Airport","GY",5.8154501915000001,-61.055400848399998]
["ANU","V.C. Bird International Airport","AG",17.136700000000001,-61.792701999999998]
["BBQ","Codrington Airport","AG",17.635798999999999,-61.828601999999997]
["BGI","Sir Grantley Adams International Airport","BB",13.074600219700001,-59.492500305199997]
["DCF","Canefield Airport","DM",15.3367004395,-61.392200469999999]
["DOM","Melville Hall Airport","DM",15.5469999313,-61.299999237100003]
["DSD","La Desirade Airport","GP",16.2968997955,-61.084400176999999]
["BBR","Baillif Airport","GP",16.013299942,-61.742198944099997]
["SFC","St-Francois Airport","GP",16.2577991486,-61.262500762899997]
["FDF","Martinique Aime Cesaire International Airport","MQ",14.5909996033,-61.003200530999997]
["SFG","L'Esperance Airport","MF",18.099899292,-63.0471992493]
["SBH","Gustaf III Airport","BL",17.904399871799999,-62.843601226799997]
["GBJ","Les Bases Airport","GP",15.868700027499999,-61.270000457800002]
["PTP","Pointe-a-Pitre Le Raizet","GP",16.2653007507,-61.531799316399997]
["LSS","Terre-de-Haut Airport","GP",15.864399909999999,-61.580600738500003]
["GND","Point Salines International Airport","GD",12.004199981699999,-61.786201477100001]
["CRU","Lauriston Airport","GD",12.476099968,-61.472801208500002]
["STT","Cyril E. King Airport","VI",18.3372993469,-64.973396301299999]
["STX","Henry E Rohlsen Airport","VI",17.701900482199999,-64.798599243200002]
["ARE","Antonio Nery Juarbe Pol Airport","PR",18.4500007629,-66.675300598099994]
["BQN","Rafael Hernandez Airport","PR",18.494899749799998,-67.129402160599994]
["CPX","Benjamin Rivera Noriega Airport","PR",18.313289000000001,-65.304323999999994]
["FAJ","Diego Jimenez Torres Airport","PR",18.308900833100001,-65.661903381299993]
["SIG","Fernando Luis Ribas Dominicci Airport","PR",18.4568004608,-66.098098754899993]
["MAZ","Eugenio Maria De Hostos Airport","PR",18.255699157700001,-67.148498535200005]
["PSE","Mercedita Airport","PR",18.008300781300001,-66.563003539999997]
["NRR","Jose Aponte de la Torre Airport","PR",18.245300293,-65.643402099599996]
["SJU","Luis Munoz Marin International Airport","PR",18.439399719200001,-66.001800537099996]
["VQS","Antonio Rivera Rodriguez Airport","PR",18.1347999573,-65.493598938000005]
["SKB","Robert L. Bradshaw International Airport","KN",17.3111991882,-62.718700408899998]
["NEV","Vance W. Amory International Airport","KN",17.205699920699999,-62.589900970499997]
["SLU","George F. L. Charles Airport","LC",14.020200000000001,-60.992901000000003]
["UVF","Hewanorra International Airport","LC",13.7332,-60.952598999999999]
["AUA","Queen Beatrix International Airport","AW",12.5013999939,-70.015197753899997]
["BON","Flamingo International Airport","BQ",12.1309995651,-68.268501281699997]
["CUR","Hato International Airport","CW",12.1888999939,-68.959800720199993]
["EUX","F. D. Roosevelt Airport","BQ",17.496500015300001,-62.979400634800001]
["SXM","Princess Juliana International Airport","SX",18.041000366199999,-63.108898162800003]
["SAB","Juancho E. Yrausquin Airport","BQ",17.645000457799998,-63.220001220699999]
["AXA","Wallblake Airport","AI",18.2047996521,-63.055099487299998]
["MNI","John A. Osborne Airport","MS",16.7914009094,-62.193298339800002]
["TAB","Tobago-Crown Point Airport","TT",11.1497001648,-60.832199096700002]
["POS","Piarco International Airport","TT",10.5953998566,-61.337200164800002]
["NGD","Captain Auguste George Airport","VG",18.727199554399999,-64.329696655299998]
["EIS","Terrance B. Lettsome International Airport","VG",18.444799423199999,-64.542999267599996]
["VIJ","Virgin Gorda Airport","VG",18.446399688700001,-64.427497863799999]
["BQU","J F Mitchell Airport","VC",12.988400459299999,-61.262001037600001]
["CIW","Canouan Airport","VC",12.699000358599999,-61.3423995972]
["MQS","Mustique Airport","VC",12.887900352500001,-61.180198669399999]
["UNI","Union Island International Airport","VC",12.6001348495,-61.411945342999999]
["SVD","E. T. Joshua Airport","VC",13.1443004608,-61.210899353000002]
["BDA","L.F. Wade International International Airport","BM",32.363998413099999,-64.678703308099998]
["ALA","Almaty Airport","KZ",43.352100372300001,77.040496826199998]
["BXH","Balkhash Airport","KZ",46.8932991028,75.004997253400006]
["USJ","Usharal Airport","KZ",46.190278042999999,80.831389126000005]
["BXJ","Boralday Airport","KZ",43.352600097699998,76.883697509800001]
["TDK","Taldykorgan Airport","KZ",45.126201629599997,78.446998596200004]
["NQZ","Astana International Airport","KZ",51.022201538099999,71.466903686500004]
["KOV","Kokshetau Airport","KZ",53.3291015625,69.594596862800003]
["PPK","Petropavlosk South Airport","KZ",54.774700164800002,69.183898925799994]
["DMB","Taraz Airport","KZ",42.853599548299997,71.303596496599994]
["CIT","Shymkent Airport","KZ",42.364200592000003,69.478897094700002]
["HSA","Hazrat Sultan International Airport","KZ",43.276901245099999,68.190399169900004]
["DZN","Zhezkazgan Airport","KZ",47.708301544199998,67.733299255399999]
["KGF","Sary-Arka Airport","KZ",49.670799255399999,73.334396362299998]
["BXY","Krainiy Airport","KZ",45.622001599999997,63.215000199999999]
["KZO","Kzyl-Orda Southwest Airport","KZ",44.706901550300003,65.592498779300001]
["URA","Uralsk Airport","KZ",51.150798797599997,51.543098449699997]
["EKB","Ekibastuz Airport","KZ",51.590999603299998,75.214996337900004]
["UKK","Ust-Kamennogorsk Airport","KZ",50.036598205600001,82.494201660200005]
["PWQ","Pavlodar Airport","KZ",52.194999694800003,77.073898315400001]
["PLX","Semey Airport","KZ",50.351388999999998,80.234443999999996]
["SCO","Aktau Airport","KZ",43.860099792500002,51.091999053999999]
["GUW","Atyrau Airport","KZ",47.121898651099997,51.821399688699998]
["AKX","Aktobe Airport","KZ",50.245800018300002,57.206699371299997]
["AYK","Arkalyk North Airport","KZ",50.318599700900002,66.952796935999999]
["KSN","Kostanay West Airport","KZ",53.206901550300003,63.550300598100002]
["GYD","Heydar Aliyev International Airport","AZ",40.467498779300001,50.046699523900003]
["GNJ","Ganja Airport","AZ",40.737701416,46.317600250200002]
["LLK","Lankaran International Airport","AZ",38.746398925800001,48.818000793499998]
["NAJ","Nakhchivan Airport","AZ",39.1888008118,45.458400726299999]
["GBB","Gabala International Airport","AZ",40.8266666667,47.712499999999999]
["ZTU","Zaqatala International Airport","AZ",41.5622215271,46.667221069299998]
["ZZE","Zangilan International Airport","AZ",39.094414,46.734098000000003]
["YLV","Yevlakh Airport","AZ",40.631900787399999,47.141899108899999]
["IKU","Issyk-Kul International Airport","KG",42.585714000000003,76.701811000000006]
["FRU","Manas International Airport","KG",43.061272000000002,74.477508]
["OSS","Osh Airport","KG",40.608997000000002,72.793214000000006]
["LWN","Gyumri Shirak Airport","AM",40.750400543200001,43.859298706099999]
["EVN","Zvartnots International Airport","AM",40.147300720200001,44.395900726299999]
["UKG","Ust-Kuyga Airport","RU",70.011001586899994,135.64500427249999]
["TLK","Talakan Airport","RU",59.876389000000003,111.044444]
["ADH","Aldan Airport","RU",58.602798461900001,125.408996582]
["YKS","Yakutsk Airport","RU",62.093299865699997,129.77099609379999]
["CNN","Kannur International Airport","IN",11.92,75.55]
["MQJ","Moma Airport","RU",66.450859069800003,143.26155090329999]
["KDY","Tyopliy Klyuch Airport","RU",62.789001464800002,136.85499572750001]
["GYG","Magan Airport","RU",62.103481292700003,129.54528808590001]
["OLZ","Olyokminsk Airport","RU",60.397499084499998,120.471000671]
["USR","Ust-Nera Airport","RU",64.550003051800005,143.11500549319999]
["UMS","Ust-Maya Airport","RU",60.356998443599998,134.4349975586]
["VHV","Verkhnevilyuisk Airport","RU",63.458057403600002,120.2691650391]
["NYR","Nyurba Airport","RU",63.294998168900001,118.3369979858]
["SUY","Suntar Airport","RU",62.185001373299997,117.6350021362]
["VYI","Vilyuisk Airport","RU",63.756668090799998,121.69333648680001]
["ULK","Lensk Airport","RU",60.720600128199997,114.825996399]
["ONK","Olenyok Airport","RU",68.514999389600007,112.4800033569]
["PYJ","Polyarny Airport","RU",66.400398254400002,112.029998779]
["MJZ","Mirny Airport","RU",62.534698486300002,114.03900146479999]
["SYS","Saskylakh Airport","RU",71.927902221699995,114.08000183110001]
["BGN","Belaya Gora Airport","RU",68.556944000000001,146.234722]
["CKH","Chokurdakh Airport","RU",70.623100280800003,147.90199279789999]
["CYX","Cherskiy Airport","RU",68.740600585899998,161.33799743649999]
["IKS","Tiksi Airport","RU",71.697700500500005,128.90299987789999]
["ZIX","Zhigansk Airport","RU",66.7965011597,123.361000061]
["KUT","Kopitnari Airport","GE",42.176700592000003,42.482601165799998]
["BUS","Batumi International Airport","GE",41.610298156699997,41.599700927699999]
["SUI","Sukhumi Dranda Airport","GE",42.858200073200003,41.128101348900003]
["TBS","Tbilisi International Airport","GE",41.6692008972,44.954700469999999]
["BQS","Ignatyevo Airport","RU",50.425399780299998,127.4120025635]
["GDG","Magdagachi Airport","RU",53.473300933799997,125.79499816889999]
["TYD","Tynda Airport","RU",55.284198760999999,124.77899932859999]
["KHV","Khabarovsk-Novy Airport","RU",48.527999877900001,135.18800354000001]
["KXK","Komsomolsk-on-Amur Airport","RU",50.409000396700002,136.9340057373]
["GVN","Maygatka Airport.","RU",48.926998138400002,140.03399658199999]
["DYR","Ugolny Airport","RU",64.734901428200004,177.74099731449999]
["PVS","Provideniya Bay Airport","RU",64.378097534199995,-173.24299621579999]
["KPW","Keperveem Airport","RU",67.845001220699999,166.13999939000001]
["GDX","Sokol Airport","RU",59.910999298100002,150.7200012207]
["KVM","Markovo Airport","RU",64.666999816900002,170.4170074463]
["PWE","Pevek Airport","RU",69.783302307100001,170.59700012210001]
["SWV","Severo-Evensk Airport","RU",61.921665191700001,159.22999572750001]
["BQG","Bogorodskoye Airport","RU",52.38,140.44800000000001]
["NLI","Nikolayevsk-na-Amure Airport","RU",53.154998779300001,140.64999389650001]
["OHO","Okhotsk Airport","RU",59.410064697300001,143.0565032959]
["PKC","Yelizovo Airport","RU",53.167900085399999,158.45399475100001]
["BVV","Burevestnik Airport","RU",44.919998168900001,147.62199401859999]
["OHH","Okha Airport","RU",53.520000457800002,142.88999939000001]
["EKS","Shakhtyorsk Airport","RU",49.190299987800003,142.08299255399999]
["DEE","Mendeleyevo Airport","RU",43.958400726299999,145.68299865700001]
["ZZO","Zonalnoye Airport","RU",50.6692008972,142.76100158700001]
["UUS","Yuzhno-Sakhalinsk Airport","RU",46.888698577900001,142.71800231930001]
["TLY","Plastun Airport","RU",44.814998626700003,136.2920074463]
["VVO","Vladivostok International Airport","RU",43.398998260500001,132.14799499509999]
["HTA","Chita-Kadala Airport","RU",52.026298522899999,113.3059997559]
["BTK","Bratsk Airport","RU",56.3706016541,101.6979980469]
["UIK","Ust-Ilimsk Airport","RU",58.136100769000002,102.5650024414]
["IKT","Irkutsk Airport","RU",52.268001556400002,104.388999939]
["ODO","Bodaybo Airport","RU",57.866100311300002,114.24299621599999]
["ERG","Yerbogachen Airport","RU",61.275001525900002,108.029998779]
["KCK","Kirensk Airport","RU",57.772998809800001,108.0640029907]
["UKX","Ust-Kut Airport","RU",56.8567008972,105.7300033569]
["UUD","Ulan-Ude Airport (Mukhino)","RU",51.807800293,107.43800354]
["UJE","Ujae Atoll Airport","MH",8.9280595778999992,165.7619934082]
["KBP","Boryspil International Airport","UA",50.345001220699999,30.894699096699998]
["DOK","Donetsk International Airport","UA",48.073600769000002,37.739700317400001]
["KRQ","Kramatorsk Airport","UA",48.705600738500003,37.628898620599998]
["MPW","Mariupol International Airport","UA",47.0760993958,37.449600219700002]
["SEV","Sievierodonetsk Airport","UA",48.900330101500003,38.541669845599998]
["VSG","Luhansk International Airport","UA",48.417400360099997,39.374099731400001]
["ERD","Berdyansk Airport","UA",46.814998626700003,36.758098602300002]
["DNK","Dnipropetrovsk International Airport","UA",48.357200622599997,35.100601196299998]
["OZH","Zaporizhzhia International Airport","UA",47.867000579799999,35.315700530999997]
["KWG","Kryvyi Rih International Airport","UA",48.043300628700003,33.209999084499998]
["SIP","Simferopol International Airport","RU",45.052200317400001,33.9751014709]
["KHC","Kerch Airport","UA",45.372501373299997,36.401401519799997]
["HRK","Kharkiv International Airport","UA",49.924800872799999,36.290000915500002]
["PLV","Suprunovka Airport","UA",49.568599700900002,34.397201538099999]
["UMY","Sumy Airport","UA",50.858299255399999,34.762500762899997]
["CKC","Cherkasy International Airport","UA",49.415599823000001,31.995300293]
["KGO","Kirovograd Airport","UA",48.542800903299998,32.284999847400002]
["IEV","Kiev Zhuliany International Airport","UA",50.401699066200003,30.449699401899998]
["GML","Gostomel Airport","UA",50.603500366200002,30.191900253299998]
["ZTR","Zhytomyr Airport","UA",50.270555999999999,28.738610999999999]
["UCK","Lutsk Airport","UA",50.678404110300001,25.487165450999999]
["HMJ","Khmelnytskyi Airport","UA",49.3596992493,26.9333992004]
["IFO","Ivano-Frankivsk International Airport","UA",48.884201049799998,24.686100006099998]
["LWO","Lviv International Airport","UA",49.8125,23.9561004639]
["CWC","Chernivtsi International Airport","UA",48.259300231899999,25.980800628699999]
["RWN","Rivne International Airport","UA",50.607101440400001,26.1415996552]
["TNL","Ternopil International Airport","UA",49.5242004395,25.7000999451]
["UDJ","Uzhhorod International Airport","UA",48.634300231899999,22.263399124100001]
["KHE","Chernobayevka Airport","UA",46.675800323499999,32.506401062000002]
["NLV","Mykolaiv International Airport","UA",47.057899475100001,31.919799804699998]
["ODS","Odessa International Airport","UA",46.426799774199999,30.676500320399999]
["VIN","Vinnytsia/Gavyryshivka Airport","UA",49.242531,28.613778]
["ARH","Talagi Airport","RU",64.600303649899999,40.7167015076]
["VKV","Vaskovo Airport","RU",64.441703796400006,40.421699523900003]
["LDG","Leshukonskoye Airport","RU",64.896003723099994,45.722999572799999]
["NNM","Naryan Mar Airport","RU",67.639999389600007,53.121898651099997]
["CSH","Solovki Airport","RU",65.029998779300001,35.733333587600001]
["CEE","Cherepovets Airport","RU",59.276667000000003,38.028333000000003]
["AMV","Amderma Airport","RU",69.7632980347,61.556400299099998]
["VRI","Varandey Airport","RU",68.848503112800003,58.201400756799998]
["KSZ","Kotlas Airport","RU",61.235801696800003,46.697498321499999]
["LED","Pulkovo Airport","RU",59.800300598100002,30.2625007629]
["KVK","Kirovsk-Apatity Airport","RU",67.463302612299998,33.588298797599997]
["MMK","Murmansk Airport","RU",68.781700134299996,32.750801086400003]
["VLU","Velikiye Luki Airport","RU",56.381099700900002,30.608100891100001]
["PKV","Pskov Airport","RU",57.7839012146,28.395599365199999]
["PES","Petrozavodsk Airport","RU",61.885200500499998,34.154701232900003]
["VUS","Velikiy Ustyug Airport","RU",60.7882995605,46.259998321499999]
["VGD","Vologda Airport","RU",59.282501220699999,39.944400787399999]
["BQT","Brest Airport","BY",52.108299255399999,23.8980998993]
["GME","Gomel Airport","BY",52.527000427200001,31.016700744600001]
["VTB","Vitebsk East Airport","BY",55.126499176000003,30.349599838300001]
["KGD","Khrabrovo Airport","RU",54.8899993896,20.592599868800001]
["GNA","Hrodna Airport","BY",53.602001190199999,24.053800582899999]
["MHP","Minsk 1 Airport","BY",53.864498138400002,27.539699554399999]
["MSQ","Minsk International Airport","BY",53.882499694800003,28.030700683599999]
["MVQ","Mogilev Airport","BY",53.954898834200002,30.0951004028]
["ABA","Abakan Airport","RU",53.740001678500001,91.385002136200001]
["BAX","Barnaul Airport","RU",53.363800048800002,83.538497924799998]
["RGK","Gorno-Altaysk Airport","RU",51.9667015076,85.833297729500003]
["KEJ","Kemerovo Airport","RU",55.270099639900003,86.107200622600004]
["EIE","Yeniseysk Airport","RU",58.474201202400003,92.112503051800005]
["TGP","Podkamennaya Tunguska Airport","RU",61.589698791499998,89.994003295900001]
["KJA","Yemelyanovo Airport","RU",56.172901153600002,92.493301391599999]
["ACS","Achinsk Airport","RU",56.2682991028,90.570800781299994]
["KYZ","Kyzyl Airport","RU",51.669399261499997,94.400596618700007]
["OVB","Tolmachevo Airport","RU",55.0125999451,82.650703430199997]
["OMS","Omsk Central Airport","RU",54.966999053999999,73.3105010986]
["SWT","Strezhevoy Airport","RU",60.709400176999999,77.660003662099996]
["TOF","Bogashevo Airport","RU",56.380298614499999,85.208297729500003]
["NOZ","Spichenkovo Airport","RU",53.811401367199998,86.877197265600003]
["DKS","Dikson Airport","RU",73.517807006799998,80.379669189500007]
["HTG","Khatanga Airport","RU",71.978103637700002,102.49099731450001]
["IAA","Igarka Airport","RU",67.437202453599994,86.621902465800005]
["NSK","Norilsk-Alykel Airport","RU",69.311096191399997,87.332199096699995]
["THX","Turukhansk Airport","RU",65.797203064000001,87.935302734399997]
["UKS","Belbek Airport","UA",44.688999176000003,33.570999145499997]
["AAQ","Anapa Airport","RU",45.002101898200003,37.347301483199999]
["EIK","Yeysk Airport","RU",46.68,38.21]
["GDZ","Gelendzhik Airport","RU",44.582092629500004,38.012480735799997]
["KRR","Krasnodar International Airport","RU",45.034698486300002,39.170501709]
["GRV","Grozny North Airport","RU",43.388301849400001,45.698600769000002]
["MCX","Uytash Airport","RU",42.816799163799999,47.652301788300001]
["MRV","Mineralnyye Vody Airport","RU",44.2251014709,43.081901550300003]
["NAL","Nalchik Airport","RU",43.5129013062,43.6366004944]
["OGZ","Beslan Airport","RU",43.2051010132,44.606601715099998]
["IGT","Magas Airport","RU",43.322299957299997,45.0125999451]
["STW","Stavropol Shpakovskoye Airport","RU",45.109199523900003,42.112800598100002]
["ROV","Platov International Airport","RU",47.500833329999999,39.933611110000001]
["RVI","Rostov-na-Donu Airport","RU",47.258201599099998,39.818099975599999]
["TGK","Taganrog Yuzhny Airport","RU",47.200000762899997,38.849998474099998]
["VLK","Zavetnoe Airport","RU",46.544300079300001,43.645698547400002]
["AER","Sochi International Airport","RU",43.449901580800002,39.956600189200003]
["ASF","Astrakhan Airport","RU",46.2832984924,48.006301879900001]
["ESL","Elista Airport","RU",46.373901367199998,44.330898284900002]
["VOG","Volgograd International Airport","RU",48.782501220699999,44.345500946000001]
["CEK","Chelyabinsk Balandino Airport","RU",55.305801391599999,61.503299713099999]
["MQF","Magnitogorsk International Airport","RU",53.393100738500003,58.755699157700001]
["SBT","Sabetta Airport","RU",71.215000000000003,72.037999999999997]
["BVJ","Bovanenkovo","RU",70.315277777999995,68.333611110999996]
["SLY","Salekhard Airport","RU",66.590797424300007,66.611000060999999]
["YMK","Mys Kamenny Airport","RU",68.483001709000007,73.567001342799998]
["KKQ","Krasnoselkup Airport","RU",65.716999999999999,82.454999999999998]
["TQL","Tarko-Sale Airport","RU",64.930801391599999,77.818099975600006]
["UEN","Urengoy Airport","RU",65.959999084499998,78.436996460000003]
["EZV","Berezovo Airport","RU",63.921001434300003,65.030502319299998]
["HMA","Khanty Mansiysk Airport","RU",61.028499603299998,69.086097717300007]
["IRM","Igrim Airport","RU",63.1987991333,64.439300537099996]
["KXD","Kondinskoye Airport","RU",59.655082702599998,67.430046081499995]
["NYA","Nyagan Airport","RU",62.1100006104,65.614997863799999]
["OVS","Sovetskiy Airport","RU",61.326622009300003,63.6019134521]
["URJ","Uray Airport","RU",60.103298187299998,64.826698303200004]
["IJK","Izhevsk Airport","RU",56.828098297099999,53.457500457800002]
["KVX","Pobedilovo Airport","RU",58.503299713099999,49.348300933799997]
["NYM","Nadym Airport","RU",65.480903625500005,72.698898315400001]
["NUX","Novy Urengoy Airport","RU",66.069396972700005,76.520301818799993]
["NJC","Nizhnevartovsk Airport","RU",60.949298858600002,76.483596801800005]
["PEE","Bolshoye Savino Airport","RU",57.914501190199999,56.021198272699998]
["KGP","Kogalym International Airport","RU",62.190399169899997,74.533798217799998]
["NFG","Nefteyugansk Airport","RU",61.108299255399999,72.650001525899995]
["NOJ","Noyabrsk Airport","RU",63.183300018300002,75.269996643100001]
["SGC","Surgut Airport","RU",61.343700408899998,73.401802063000005]
["SVX","Koltsovo Airport","RU",56.743099212600001,60.802700042700003]
["TOX","Tobolsk Airport","RU",58.135799407999997,68.231903076199998]
["TJM","Roshchino International Airport","RU",57.189601898200003,65.324302673299997]
["KRO","Kurgan Airport","RU",55.475299835199998,65.415603637700002]
["ASB","Ashgabat Airport","TM",37.986801147500003,58.361000060999999]
["KEA","Kerki International Airport","TM",37.808889000000001,65.212500000000006]
["KRW","Turkmenbashi Airport","TM",40.063301086400003,53.007198333700003]
["MYP","Mary Airport","TM",37.619400024400001,61.896701812700002]
["TAZ","Dashoguz Airport","TM",41.761100769000002,59.826698303199997]
["CRZ","Turkmenabat International Airport","TM",38.930833,63.563889000000003]
["DYU","Dushanbe Airport","TJ",38.543300628700003,68.824996948199995]
["TJU","Kulob Airport","TJ",37.9880981445,69.805000305199997]
["LBD","Khudzhand Airport","TJ",40.2154006958,69.694702148399998]
["KQT","Qurghonteppa International Airport","TJ",37.866401672400002,68.864700317399993]
["AZN","Andizhan Airport","UZ",40.727699279799999,72.293998718300003]
["FEG","Fergana Airport","UZ",40.358798980700001,71.745002746599994]
["NMA","Namangan Airport","UZ",40.984600067099997,71.556701660200005]
["MOK","Muynak Airport","UZ",43.755199432399998,59.0308990479]
["NCU","Nukus Airport","UZ",42.4883995056,59.623298644999998]
["UGC","Urgench Airport","UZ",41.584300994899998,60.641700744600001]
["NVI","Navoi Airport","UZ",40.117198944099997,65.170799255399999]
["BHK","Bukhara Airport","UZ",39.775001525900002,64.483299255399999]
["KSQ","Karshi Khanabad Airport","UZ",38.833599090600003,65.9215011597]
["AFS","Sugraly Airport","UZ",41.613899230999998,64.233200073199995]
["SKD","Samarkand Airport","UZ",39.700500488300001,66.983802795399995]
["TMJ","Termez Airport","UZ",37.286701202400003,67.309997558600003]
["TAS","Tashkent International Airport","UZ",41.257900237999998,69.281196594199997]
["KMW","Dyagilevo Air Base","RU",54.644699096700002,39.570400237999998]
["BKA","Bykovo Airport","RU",55.617198944099997,38.060001373299997]
["KLF","Grabtsevo Airport","RU",54.549999237100003,36.366668701199998]
["IWA","Ivanovo South Airport","RU",56.939399719199997,40.940799713099999]
["RYB","Staroselye Airport","RU",58.104198455800002,38.929401397699998]
["BZK","Bryansk Airport","RU",53.214199066200003,34.176399230999998]
["LNX","Smolensk South Airport","RU",54.744999999999997,32.064999999999998]
["DME","Domodedovo International Airport","RU",55.408798217799998,37.906299591100002]
["IAR","Tunoshna Airport","RU",57.560699462899997,40.157398223900003]
["SVO","Sheremetyevo International Airport","RU",55.972599029500003,37.414600372300001]
["KLD","Migalovo Air Base","RU",56.824699401899998,35.757701873800002]
["OSF","Ostafyevo International Airport","RU",55.511699676500001,37.507198333700003]
["CKL","Chkalovskiy Airport","RU",55.878299713099999,38.061698913599997]
["EGO","Belgorod International Airport","RU",50.643798828100003,36.5900993347]
["URS","Kursk East Airport","RU",51.750598907499999,36.295600891100001]
["LPK","Lipetsk Airport","RU",52.7028007507,39.537799835199998]
["VOZ","Voronezh International Airport","RU",51.814201355000002,39.229598998999997]
["OEL","Oryol Yuzhny Airport","RU",52.934700012199997,36.002201080299997]
["TBW","Donskoye Airport","RU",52.806098937999998,41.482799530000001]
["RZN","Turlatovo Airport","RU",54.555900573700001,39.855201721199997]
["VKO","Vnukovo International Airport","RU",55.591499328600001,37.261501312299998]
["UCT","Ukhta Airport","RU",63.5668983459,53.804698944099997]
["INA","Inta Airport","RU",66.054832458500002,60.110321044899997]
["PEX","Pechora Airport","RU",65.121101379400002,57.130798339800002]
["USK","Usinsk Airport","RU",66.004699707,57.367198944099997]
["VKT","Vorkuta Airport","RU",67.488601684599999,63.993099212600001]
["UTS","Ust-Tsylma Airport","RU",65.437294006299993,52.200336456300001]
["SCW","Syktyvkar Airport","RU",61.646999359100001,50.8451004028]
["GOJ","Nizhny Novgorod International Airport","RU",56.230098724400001,43.784000396700002]
["UUA","Bugulma Airport","RU",54.6399993896,52.801700592000003]
["KZN","Kazan International Airport","RU",55.606201171899997,49.278701782200002]
["NBC","Begishevo Airport","RU",55.564701080299997,52.092498779300001]
["JOK","Yoshkar-Ola Airport","RU",56.700599670400003,47.904701232900003]
["CSY","Cheboksary Airport","RU",56.090301513699998,47.347301483199999]
["ULV","Ulyanovsk Baratayevka Airport","RU",54.2682991028,48.226699829099999]
["ULY","Ulyanovsk East Airport","RU",54.401000976600002,48.802700042700003]
["REN","Orenburg Central Airport","RU",51.795799255399999,55.456699371299997]
["OSW","Orsk Airport","RU",51.072498321499999,58.595600128199997]
["PEZ","Penza Airport","RU",53.110599517799997,45.021099090600003]
["SKX","Saransk Airport","RU",54.125129699699997,45.212257385299999]
["BWO","Balakovo Airport","RU",51.858299255399999,47.7456016541]
["GSV","Saratov Gagarin Airport","RU",51.712778,46.171111000000003]
["RTW","Saratov Central Airport","RU",51.564998626700003,46.046699523900003]
["BCX","Beloretsk Airport","RU",53.938098907499999,58.340000152599998]
["NEF","Neftekamsk Airport","RU",56.106899261499997,54.347198486300002]
["OKT","Oktyabrskiy Airport","RU",54.439998626700003,53.388301849400001]
["UFA","Ufa International Airport","RU",54.5574989319,55.874401092500001]
["KUF","Kurumoch International Airport","RU",53.504901885999999,50.164299011200001]
["DIU","Diu Airport","IN",20.713100433299999,70.921096801800005]
["AMD","Sardar Vallabhbhai Patel International Airport","IN",23.077199935900001,72.634696960400007]
["AKD","Akola Airport","IN",20.6989994049,77.058601379400002]
["IXU","Aurangabad Airport","IN",19.8626995087,75.398101806599996]
["BOM","Chhatrapati Shivaji International Airport","IN",19.088699340800002,72.867897033700004]
["PAB","Bilaspur Airport","IN",21.9883995056,82.111000060999999]
["BHJ","Bhuj Airport","IN",23.287799835200001,69.670196533199999]
["IXG","Belgaum Airport","IN",15.8592996597,74.618301391599999]
["BDQ","Vadodara Airport","IN",22.336200714099999,73.226303100600006]
["BHO","Bhopal Airport","IN",23.287500381499999,77.337402343799994]
["BHU","Bhavnagar Airport","IN",21.752199173000001,72.185203552199994]
["NMB","Daman Airport","IN",20.434400558499998,72.843200683600003]
["GUX","Guna Airport","IN",24.654699325599999,77.347297668500005]
["HBX","Hubli Airport","IN",15.361700058,75.084899902299995]
["HSR","Rajkot International Airport","IN",22.381914999999999,71.031681000000006]
["IDR","Devi Ahilyabai Holkar Airport","IN",22.721799850499998,75.801101684599999]
["JLR","Jabalpur Airport","IN",23.177799224899999,80.052001953100003]
["JGA","Jamnagar Airport","IN",22.465499877900001,70.012603759800001]
["IXY","Kandla Airport","IN",23.1126995087,70.100303649899999]
["HJR","Khajuraho Airport","IN",24.817199707,79.918601989699994]
["KLH","Kolhapur Airport","IN",16.664699554399999,74.289398193400004]
["IXK","Keshod Airport","IN",21.317100524899999,70.270401000999996]
["LTU","Murod Kond Airport","IN",18.411500930799999,76.464698791499998]
["NDC","Nanded Airport","IN",19.183300018299999,77.316703796400006]
["NAG","Dr. Babasaheb Ambedkar International Airport","IN",21.092199325599999,79.047203064000001]
["ISK","Ozar Air Force Station","IN",20.119100570699999,73.912902832]
["PNQ","Pune Airport","IN",18.582099914600001,73.919700622600004]
["PBD","Porbandar Airport","IN",21.648700714099999,69.657203674300007]
["RTC","Ratnagiri Airport","IN",17.0135993958,73.327796935999999]
["RAJ","Rajkot Airport","IN",22.309200286900001,70.779502868700007]
["RPR","Raipur Airport","IN",21.180400848400001,81.738800048800002]
["SAG","Shirdi Airport","IN",19.688611000000002,74.378889000000001]
["SSE","Solapur Airport","IN",17.6280002594,75.934799194299998]
["STV","Surat Airport","IN",21.114099502599998,72.741798400899995]
["UDR","Maharana Pratap Airport","IN",24.617700576800001,73.896102905299998]
["CMB","Bandaranaike International Colombo Airport","LK",7.1807599067999996,79.884101867699997]
["ACJ","Anuradhapura Air Force Base","LK",8.3014898299999995,80.427902221699995]
["BTC","Batticaloa Airport","LK",7.7057600020999999,81.678802490199999]
["RML","Colombo Ratmalana Airport","LK",6.8219900130999998,79.886199951199998]
["GOY","Amparai Airport","LK",7.3370800018000004,81.625900268600006]
["JAF","Kankesanturai Airport","LK",9.7923297882,80.070098877000007]
["KCT","Koggala Airport","LK",5.9936800003000004,80.320297241199995]
["KTY","Katukurunda Air Force Base","LK",6.5521202086999999,79.977500915500002]
["GIU","Sigiriya Air Force Base","LK",7.9566698074,80.728500366199995]
["TRR","China Bay Airport","LK",8.5385103226000005,81.181900024399994]
["WRZ","Weerawila International Airport","LK",6.2544898987000002,81.235198974599996]
["HRI","Mattala Rajapaksa International Airport","LK",6.2888890000000002,81.123610999999997]
["BBM","Battambang Airport","KH",13.095600128199999,103.2239990234]
["KZC","Kampong Chhnang Airport","KH",12.255200386,104.5640029907]
["KKZ","Kaoh Kong Airport","KH",11.6133971186,102.997083664]
["KTI","Techo International Airport","KH",11.362916999999999,104.916611]
["MWV","Mondulkiri Airport","KH",12.463647911600001,107.18725204499999]
["PNH","Phnom Penh International Airport","KH",11.5466003418,104.84400177000001]
["RBE","Ratanakiri Airport","KH",13.7299995422,106.98699951170001]
["SAI","Siem Reap–Angkor International Airport","KH",13.375278,104.220833]
["REP","Angkor International Airport","KH",13.4106998444,103.81300354]
["TNX","Stung Treng Airport","KH",13.5319004059,106.01499938960001]
["KOS","Sihanoukville International Airport","KH",10.579700470000001,103.63700103799999]
["AZH","Azamgarh Airport","IN",26.153333,83.118333000000007]
["IXV","Along Airport","IN",28.175300598100002,94.802001953100003]
["IXA","Agartala Airport","IN",23.8869991302,91.240402221699995]
["AYJ","Ayodhya Airport","IN",26.748034000000001,82.150780999999995]
["IXB","Bagdogra Airport","IN",26.681200027500001,88.328598022500003]
["RGH","Balurghat Airport","IN",25.261699676500001,88.795600891099994]
["SHL","Shillong Airport","IN",25.703599929799999,91.9786987305]
["VNS","Lal Bahadur Shastri Airport","IN",25.452400207499998,82.859298706100006]
["BBI","Biju Patnaik Airport","IN",20.244400024400001,85.8178024292]
["CCU","Netaji Subhash Chandra Bose International Airport","IN",22.654699325599999,88.446701049799998]
["COH","Cooch Behar Airport","IN",26.330499649,89.467201232899995]
["CWK","Chitrakoot Airport","IN",25.167694000000001,80.9358]
["KNU","Kanpur Airport","IN",26.441400527999999,80.364898681599996]
["DBD","Dhanbad Airport","IN",23.833999633800001,86.425300598099994]
["DBR","Darbhanga Airport","IN",26.194721999999999,85.917500000000004]
["DGH","Deoghar Airport","IN",24.444721999999999,86.702500000000001]
["DAE","Daporijo Airport","IN",27.985500335699999,94.222801208500002]
["GOP","Gorakhpur Airport","IN",26.739700317400001,83.449699401900006]
["GAU","Lokpriya Gopinath Bordoloi International Airport","IN",26.106100082400001,91.585899353000002]
["GAY","Gaya Airport","IN",24.744300842299999,84.951202392599996]
["HGI","Donyi Polo Airport","IN",26.971841000000001,93.642308]
["IMF","Imphal Airport","IN",24.760000228900001,93.896697997999993]
["JRG","Jharsuguda Airport","IN",21.913499832199999,84.050399780299998]
["PYB","Jeypore Airport","IN",18.879999160800001,82.552001953100003]
["IXW","Jamshedpur Airport","IN",22.8131999969,86.168800353999998]
["JRH","Jorhat Airport","IN",26.731500625599999,94.175498962399999]
["KBK","Kushinagar International Airport","IN",26.77,83.908056000000002]
["IXQ","Kamalpur Airport","IN",24.1317005157,91.814201354999994]
["IXH","Kailashahar Airport","IN",24.308200836200001,92.007202148399998]
["IXS","Silchar Airport","IN",24.912900924700001,92.9786987305]
["IXN","Khowai Airport","IN",24.061899185200001,91.603897094700002]
["AJL","Lengpui Airport","IN",23.840599060100001,92.6196975708]
["IXI","North Lakhimpur Airport","IN",27.295499801599998,94.097602844199997]
["LDA","Malda Airport","IN",25.010999999999999,88.126999999999995]
["DIB","Dibrugarh Airport","IN",27.483900070200001,95.016899108900006]
["DMU","Dimapur Airport","IN",25.883899688700001,93.771102905299998]
["MZU","Muzaffarpur Airport","IN",26.119100570699999,85.313697814899996]
["IXT","Pasighat Airport","IN",28.066099166899999,95.335601806599996]
["PAT","Lok Nayak Jayaprakash Airport","IN",25.591299057000001,85.087997436500004]
["PYG","Pakyong Airport","IN",27.232500000000002,88.588333000000006]
["IXR","Birsa Munda Airport","IN",23.314300537099999,85.321701049799998]
["RRK","Rourkela Airport","IN",22.2567005157,84.814598083500002]
["RUP","Rupsi India Airport","IN",26.139699935900001,89.910003662099996]
["TEI","Tezu Airport","IN",27.9412002563,96.134399414100002]
["TEZ","Tezpur Airport","IN",26.709100723300001,92.784698486300002]
["ZER","Zero Airport","IN",27.588300705000002,93.828102111800007]
["BZL","Barisal Airport","BD",22.8010005951,90.3012008667]
["CXB","Cox's Bazar Airport","BD",21.452199935900001,91.963897705099996]
["CLA","Comilla Airport","BD",23.437200546300001,91.189697265600003]
["CGP","Shah Amanat International Airport","BD",22.249599456799999,91.813301086400003]
["DAC","Dhaka / Hazrat Shahjalal International Airport","BD",23.843347000000001,90.397783000000004]
["IRD","Ishurdi Airport","BD",24.152500152599998,89.049400329600005]
["JSR","Jessore Airport","BD",23.1837997437,89.160797119099996]
["LLJ","Lalmonirhat Airport","BD",25.8875007629,89.433097839400006]
["RJH","Shah Mokhdum Airport","BD",24.437200546300001,88.616500854500003]
["SPD","Saidpur Airport","BD",25.759199142500002,88.908897399899999]
["TKR","Thakurgaon Airport","BD",26.016399383500001,88.403602600100001]
["ZHM","Shamshernagar Airport","BD",24.416999816899999,91.883003234900002]
["ZYL","Osmany International Airport","BD",24.963199615499999,91.866798400899995]
["HKG","Chek Lap Kok International Airport","HK",22.308900833100001,113.915000916]
["AGR","Agra Airport","IN",27.155799865700001,77.960899353000002]
["HRH","Dhanipur Airstrip","IN",27.860856310999999,78.146867752099993]
["IXD","Allahabad Airport","IN",25.440099716199999,81.733901977499997]
["ATQ","Sri Guru Ram Dass Jee International Airport Amritsar","IN",31.7096004486,74.797302246100003]
["AIP","Adampur Air Force Station","IN",31.4337997437,75.758796691900002]
["BKB","Nal Airport","IN",28.070600509599998,73.207199096699995]
["KUU","Kullu Manali Airport","IN",31.8766994476,77.154403686500004]
["BUP","Bhatinda Air Force Station","IN",30.2700996399,74.755798339799995]
["BEK","Bareilly Air Force Station","IN",28.422100067100001,79.4507980347]
["IXC","Chandigarh Airport","IN",30.673500060999999,76.788497924799998]
["DED","Dehradun Airport","IN",30.189699173000001,78.180297851600002]
["DEL","Indira Gandhi International Airport","IN",28.5664997101,77.103103637700002]
["HDO","Hindon Air Force Station","IN",28.707700729399999,77.358901977499997]
["DHM","Kangra Airport","IN",32.165100097699998,76.263397216800001]
["GWL","Gwalior Airport","IN",26.293300628699999,78.227798461899994]
["HSS","Hissar Airport","IN",29.179399490400002,75.7553024292]
["JDH","Jodhpur Airport","IN",26.2511005402,73.048896789599993]
["JAI","Jaipur International Airport","IN",26.824199676500001,75.812202453599994]
["JSA","Jaisalmer Airport","IN",26.888700485200001,70.864997863799999]
["IXJ","Jammu Airport","IN",32.689098358199999,74.837402343799994]
["KQH","Kishangarh Airport, Ajmer","IN",26.591166999999999,74.816166999999993]
["KTU","Kota Airport","IN",25.160200118999999,75.845596313499996]
["LUH","Ludhiana Airport","IN",30.8547000885,75.952598571799996]
["IXL","Leh Kushok Bakula Rimpochee Airport","IN",34.135898590099998,77.5465011597]
["LKO","Chaudhary Charan Singh International Airport","IN",26.7605991364,80.889297485399993]
["DXN","Noida International Airport","IN",28.17,77.61]
["IXP","Pathankot Air Force Station","IN",32.233798980700001,75.634597778300005]
["PGH","Pantnagar Airport","IN",29.033399581899999,79.473701477099993]
["SLV","Shimla Airport","IN",31.0818004608,77.068000793500005]
["SXR","Sheikh ul Alam Airport","IN",33.9870986938,74.774200439500007]
["TNI","Satna Airport","IN",24.562299728399999,80.854896545399995]
["VSV","Shravasti Airport","IN",27.503056000000001,82.026944]
["AOU","Attopeu Airport","LA",14.814715357000001,106.821699142]
["OUI","Ban Huoeisay Airport","LA",20.257299423199999,100.43699646]
["LPQ","Luang Phabang International Airport","LA",19.897300720200001,102.1610031128]
["LXG","Luang Namtha Airport","LA",20.966999053999999,101.4000015259]
["ODY","Oudomsay Airport","LA",20.6826992035,101.9940032959]
["PKZ","Pakse International Airport","LA",15.132100105299999,105.78099822999999]
["ZBY","Sayaboury Airport","LA",19.232999801599998,101.73300170900001]
["ZVK","Savannakhet Airport","LA",16.556600570699999,104.7600021362]
["NEU","Sam Neua Airport","LA",20.4183998108,104.0670013428]
["VNA","Saravane Airport","LA",15.709439207699999,106.410698891]
["THK","Thakhek Airport","LA",17.399999618500001,104.8000030518]
["VTE","Wattay International Airport","LA",17.988300323499999,102.56300354]
["XKH","Xieng Khouang Airport","LA",19.4500007629,103.15799713129999]
["MFM","Macau International Airport","MO",22.149599075299999,113.59200286870001]
["BJH","Bajhang Airport","NP",29.538999557499999,81.185401916499998]
["BHP","Bhojpur Airport","NP",27.147399902299998,87.050796508800005]
["BGL","Baglung Airport","NP",28.212799072300001,83.666297912600001]
["BHR","Bharatpur Airport","NP",27.678100585900001,84.429397582999997]
["BJU","Bajura Airport","NP",29.5020008087,81.668998718300003]
["BIT","Baitadi Airport","NP",29.4652996063,80.5492019653]
["BWA","Bhairahawa Airport","NP",27.505699157700001,83.416297912600001]
["BDP","Bhadrapur Airport","NP",26.570800781199999,88.079597473099994]
["DNP","Tulsipur Airport","NP",28.111099243200002,82.294197082500006]
["DHI","Dhangarhi Airport","NP",28.753299713099999,80.581901550300003]
["DAP","Darchula Airport","NP",29.6692008972,80.548400878899997]
["DOP","Dolpa Airport","NP",28.9857006073,82.819099426299999]
["SIH","Silgadi Doti Airport","NP",29.263099670399999,80.935997009299996]
["GKH","Gorkha Airport","NP",28.0499992371,84.483001709000007]
["JIR","Jiri Airport","NP",27.617000579799999,86.217002868700007]
["JUM","Jumla Airport","NP",29.2742004395,82.193298339799995]
["JKR","Janakpur Airport","NP",26.708799362200001,85.922401428200004]
["JMO","Jomsom Airport","NP",28.780425999999999,83.722999999999999]
["KTM","Tribhuvan International Airport","NP",27.696599960299999,85.359100341800001]
["LDN","Lamidanda Airport","NP",27.253099441500002,86.669998168899994]
["LUA","Lukla Airport","NP",27.686899185200001,86.729698181200007]
["LTG","Langtang Airport","NP",28.2000007629,85.583000183099998]
["NGX","Manang Airport","NP",28.641399383500001,84.089202880900004]
["MEY","Meghauli Airport","NP",27.577400000000001,84.228750000000005]
["XMG","Mahendranagar Airport","NP",28.963199615499999,80.147903442399993]
["KEP","Nepalgunj Airport","NP",28.1035995483,81.666999816900002]
["PKR","Pokhara International Airport","NP",28.1845065592995,84.013248901776706]
["PPL","Phaplu Airport","NP",27.517786880900001,86.584453582799995]
["RJB","Rajbiraj Airport","NP",26.517000198400002,86.75]
["RHP","Ramechhap Airport","NP",27.3939990997,86.061401367200006]
["RUK","Rukumkot Airport","NP",28.6270008087,82.194999694800003]
["RPA","Rolpa Airport","NP",28.267000198400002,82.766998290999993]
["RUM","Rumjatar Airport","NP",27.303499221799999,86.550399780299998]
["SIF","Simara Airport","NP",27.159500122099999,84.980102539100002]
["SKH","Surkhet Airport","NP",28.586000442500001,81.636001586899994]
["FEB","Sanfebagar Airport","NP",29.232999801599998,81.217002868700007]
["IMK","Simikot Airport","NP",29.9710998535,81.818901061999995]
["TPJ","Suketar Airport","NP",27.350899999999999,87.695250000000001]
["TPU","Tikapur Airport","NP",28.517000198400002,81.150001525899995]
["TMI","Tumling Tar Airport","NP",27.315000534100001,87.193298339799995]
["BIR","Biratnagar Airport","NP",26.481500625599999,87.263999939000001]
["AGX","Agatti Airport","IN",10.8236999512,72.176002502399996]
["BEP","Bellary Airport","IN",15.1627998352,76.882797241199995]
["BLR","Bengaluru International Airport","IN",13.1978998184,77.706298828100003]
["VGA","Vijayawada Airport","IN",16.530399322499999,80.796798706100006]
["CJB","Coimbatore International Airport","IN",11.029999733,77.043403625500005]
["COK","Cochin International Airport","IN",10.152000427200001,76.401901245100007]
["CCJ","Calicut International Airport","IN",11.1367998123,75.955299377399996]
["CDP","Cuddapah Airport","IN",14.510000228899999,78.772796630900004]
["CBD","Car Nicobar Air Force Station","IN",9.1525096893000004,92.819602966299996]
["GOX","Manohar International Airport","IN",15.732200000000001,73.867999999999995]
["GOI","Dabolim Airport","IN",15.380833000000001,73.826999999999998]
["HYD","Rajiv Gandhi International Airport Shamshabad","IN",17.231317520099999,78.429855346699995]
["BPM","Begumpet Airport","IN",17.4531002045,78.467597961400003]
["VDY","Vijayanagar Aerodrome (JSW)","IN",15.1749666667,76.634947222199997]
["KJB","Kurnool Airport","IN",15.713680999999999,78.161561000000006]
["IXM","Madurai Airport","IN",9.8345098495999999,78.093399047899993]
["IXE","Mangalore International Airport","IN",12.9612998962,74.890098571799996]
["MAA","Chennai International Airport","IN",12.9900054932,80.169296264600007]
["MYQ","Mysore Airport","IN",12.3072004318,76.649696350100001]
["IXZ","Vir Savarkar International Airport","IN",11.6412000656,92.729698181200007]
["PNY","Pondicherry Airport","IN",11.9687004089,79.810096740700004]
["RJA","Rajahmundry Airport","IN",17.1103992462,81.818199157699993]
["RQY","Shivamogga Airport","IN",13.854722000000001,75.610556000000003]
["SXV","Salem Airport","IN",11.7833003998,78.065597534199995]
["TJV","Tanjore Air Force Base","IN",10.7223997116,79.101600646999998]
["TCR","Tuticorin Airport","IN",8.7241669999999996,78.025833000000006]
["TIR","Tirupati Airport","IN",13.6324996948,79.543296814000001]
["TRZ","Tiruchirapally Civil Airport Airport","IN",10.765399932899999,78.709701538100006]
["TRV","Trivandrum International Airport","IN",8.4821195601999992,76.920097351099997]
["VTZ","Vishakhapatnam Airport","IN",17.721200942999999,83.224502563499996]
["WGC","Warangal Airport","IN",17.9144001007,79.602203369099996]
["PBH","Paro Airport","BT",27.403200149500002,89.424598693799993]
["HRF","Hoarafushi Airport","MV",6.9691817992455602,72.896501268515294]
["HDK","Kulhudhuffushi Airport","MV",6.6311109999999998,73.066666999999995]
["FND","Funadhoo Airport","MV",6.161111,73.287222]
["NMF","Maafaru International Airport","MV",5.822222,73.474722]
["IFU","Ifuru Airport","MV",5.7083000000000004,73.025000000000006]
["LMV","Madivaru Airport","MV",5.4573999999999998,73.370099999999994]
["FVM","Fuvahmulah Airport","MV",-0.30972222220000001,73.435000000000002]
["GAN","Gan International Airport","MV",-0.69334197040000001,73.155601501500001]
["HAQ","Hanimaadhoo Airport","MV",6.7442297934999997,73.170501709000007]
["KDO","Kadhdhoo Airport","MV",1.85916996,73.521896362299998]
["MLE","Male International Airport","MV",4.1918301582000002,73.529098510699995]
["KDM","Kaadedhdhoo Airport","MV",0.48813098669999999,72.996902465800005]
["VAM","Villa Airport","MV",3.4705555555999998,72.835833333300002]
["RUL","Maavaarulaa Airport","MV",0.33666699999999999,73.511388999999994]
["DMK","Don Mueang International Airport","TH",13.912599563600001,100.6070022583]
["KKM","Khok Kathiam Airport","TH",14.874600410499999,100.663002014]
["KDT","Kamphaeng Saen Airport","TH",14.1020002365,99.917198181200007]
["TDX","Trat Airport","TH",12.274600029,102.31900024399999]
["BKK","Suvarnabhumi Airport","TH",13.681099891700001,100.74700164790001]
["UTP","U-Tapao International Airport","TH",12.6799001694,101.00499725340001]
["CNX","Chiang Mai International Airport","TH",18.766799926800001,98.962600707999997]
["HGN","Mae Hong Son Airport","TH",19.301300048800002,97.975799560499993]
["PYY","Mae Hong Son Airport","TH",19.3719997406,98.436996460000003]
["LPT","Lampang Airport","TH",18.270900726299999,99.504203796400006]
["NNT","Nan Airport","TH",18.807899475100001,100.78299713129999]
["PRH","Phrae Airport","TH",18.132200241100001,100.1650009155]
["CEI","Chiang Rai International Airport","TH",19.952299117999999,99.882896423299997]
["BAO","Udorn Air Base","TH",17.382999420200001,102.8000030518]
["PHY","Phetchabun Airport","TH",16.6760005951,101.19499969500001]
["HHQ","Hua Hin Airport","TH",12.6361999512,99.951499939000001]
["TKH","Takhli Airport","TH",15.277299880999999,100.29599761999999]
["MAQ","Mae Sot Airport","TH",16.699899673499999,98.545097351099997]
["THS","Sukhothai Airport","TH",17.2380008698,99.818199157699993]
["PHS","Phitsanulok Airport","TH",16.7828998566,100.27899932859999]
["TKT","Tak Airport","TH",16.8959999084,99.2533035278]
["UTR","Uttaradit Airport","TH",17.617000579799999,100.0999984741]
["URT","Surat Thani Airport","TH",9.1325998306000002,99.135597228999998]
["NAW","Narathiwat Airport","TH",6.5199198723,101.74299621580001]
["CJM","Chumphon Airport","TH",10.7111997604,99.3617019653]
["NST","Nakhon Si Thammarat Airport","TH",8.5396203995000004,99.944702148399998]
["KBV","Krabi Airport","TH",8.0991201401000001,98.986198425300003]
["SGZ","Songkhla Airport","TH",7.1865601540000004,100.60800170900001]
["PAN","Pattani Airport","TH",6.7854599953000001,101.15399932859999]
["USM","Samui Airport","TH",9.5477895736999994,100.06199646]
["HKT","Phuket International Airport","TH",8.1132001877000004,98.316902160599994]
["UNN","Ranong Airport","TH",9.7776203156000001,98.585502624499995]
["HDY","Hat Yai International Airport","TH",6.9332098961000002,100.39299774200001]
["TST","Trang Airport","TH",7.5087399482999997,99.616600036600005]
["UTH","Udon Thani Airport","TH",17.386400222799999,102.788002014]
["SNO","Sakon Nakhon Airport","TH",17.195100784299999,104.1190032959]
["PXR","Surin Airport","TH",14.8683004379,103.4980010986]
["KKC","Khon Kaen Airport","TH",16.466600418100001,102.783996582]
["LOE","Loei Airport","TH",17.439100265499999,101.7220001221]
["BFV","Buri Ram Airport","TH",15.229499816900001,103.25299835209999]
["NAK","Nakhon Ratchasima Airport","TH",14.9495000839,102.31300354]
["UBP","Ubon Ratchathani Airport","TH",15.251299858099999,104.870002747]
["ROI","Roi Et Airport","TH",16.116800308199998,103.7740020752]
["KOP","Nakhon Phanom Airport","TH",17.3838005066,104.6429977417]
["BMV","Buon Ma Thuot Airport","VN",12.668299675,108.120002747]
["VCL","Chu Lai International Airport","VN",15.4033002853,108.706001282]
["HPH","Cat Bi International Airport","VN",20.819400787399999,106.7249984741]
["CAH","Ca Mau Airport","VN",9.1776666667000004,105.17777777800001]
["CXR","Cam Ranh Airport","VN",11.9982004166,109.21900177000001]
["VCS","Co Ong Airport","VN",8.7318296432999993,106.633003235]
["VCA","Tra Noc Airport","VN",10.085100174000001,105.7119979858]
["DIN","Dien Bien Phu Airport","VN",21.397499084500001,103.008003235]
["VDH","Dong Hoi Airport","VN",17.515000000000001,106.59055600000001]
["DLI","Lien Khuong Airport","VN",11.75,108.3669967651]
["DAD","Da Nang International Airport","VN",16.0438995361,108.1989974976]
["HAN","Noi Bai International Airport","VN",21.221200942999999,105.8069992065]
["SQH","Na-San Airport","VN",21.216999053999999,104.03299713129999]
["NHA","Nha Trang Air Base","VN",12.2274999619,109.192001343]
["HUI","Phu Bai Airport","VN",16.401500701900002,107.70300293]
["UIH","Phu Cat Airport","VN",13.954999923700001,109.041999817]
["PXU","Pleiku Airport","VN",14.0045003891,108.01699829099999]
["PQC","Phu Quoc Airport","VN",10.2270002365,103.967002869]
["PHA","Phan Rang Airport","VN",11.633500099200001,108.952003479]
["PHH","Phan Thiet Airport","VN",10.9063997269,108.0690002441]
["VKG","Rach Gia Airport","VN",9.9580299723000003,105.132379532]
["TBB","Dong Tac Airport","VN",13.049599647499999,109.33399963399999]
["SGN","Tan Son Nhat International Airport","VN",10.818799972500001,106.652000427]
["THD","Thọ Xuân Airport","VN",19.901667,105.467778]
["VDO","Van Don International Airport","VN",21.117778000000001,107.41416700000001]
["VII","Vinh Airport","VN",18.737600326500001,105.67099761999999]
["VTG","Vung Tau Airport","VN",10.3725004196,107.0950012207]
["VBA","Ann Airport","MM",19.769199371300001,94.026100158700004]
["NYU","Bagan Airport","MM",21.178800582899999,94.930198669399999]
["BMO","Banmaw Airport","MM",24.2689990997,97.246200561500004]
["VBP","Bokpyinn Airport","MM",11.2670001984,98.766998290999993]
["VBC","Chanmyathazi Airport","MM",21.9405002594,96.089599609399997]
["TVY","Dawei Airport","MM",14.103899955699999,98.203598022500003]
["NYT","Naypyidaw Airport","MM",19.623500824000001,96.200996398900003]
["GAW","Gangaw Airport","MM",22.174699783299999,94.134399414100002]
["GWA","Gwa Airport","MM",17.600000381499999,94.583297729500003]
["HEH","Heho Airport","MM",20.7469997406,96.791999816900002]
["HOX","Hommalinn Airport","MM",24.899599075299999,94.914001464799995]
["TIO","Tilin Airport","MM",21.7000007629,94.099998474100005]
["KET","Kengtung Airport","MM",21.301599502599998,99.636001586899994]
["KHM","Kanti Airport","MM",25.988300323499999,95.674400329600005]
["KMV","Kalay Airport","MM",23.1888008118,94.051101684599999]
["KYP","Kyaukpyu Airport","MM",19.426399231000001,93.534797668500005]
["KAW","Kawthoung Airport","MM",10.049300193800001,98.538002014200003]
["KYT","Kyauktu Airport","MM",21.399999618500001,94.133300781299994]
["LIW","Loikaw Airport","MM",19.6914997101,97.2147979736]
["LSH","Lashio Airport","MM",22.9778995514,97.752197265600003]
["MDL","Mandalay International Airport","MM",21.702199935900001,95.977897643999995]
["MGZ","Myeik Airport","MM",12.4398002625,98.621498107899995]
["MYT","Myitkyina Airport","MM",25.383600234999999,97.351898193400004]
["MNU","Mawlamyine Airport","MM",16.444700241100001,97.660697936999995]
["MGU","Manaung Airport","MM",18.845800399800002,93.688903808600003]
["MOE","Momeik Airport","MM",23.092500686600001,96.645301818799993]
["MOG","Mong Hsat Airport","MM",20.516799926800001,99.256797790500002]
["MGK","Mong Tong Airport","MM",20.296699523899999,98.898902893100001]
["MWQ","Magway Airport","MM",20.165599823000001,94.941398620599998]
["NYW","Monywar Airport","MM",22.232999801599998,95.116996765099998]
["NMS","Namsang Airport","MM",20.890499115000001,97.735900878899997]
["NMT","Namtu Airport","MM",23.083000183100001,97.383003234900002]
["PAA","Hpa-N Airport","MM",16.893699646000002,97.674598693799993]
["PAU","Pauk Airport","MM",21.449199676500001,94.486900329600005]
["BSX","Pathein Airport","MM",16.815200805700002,94.7798995972]
["PPU","Hpapun Airport","MM",18.066699981700001,97.449798584000007]
["PBU","Putao Airport","MM",27.329900741599999,97.426300048800002]
["PKK","Pakhokku Airport","MM",21.404299999999999,95.111249999999998]
["PRU","Pyay Airport","MM",18.8244991302,95.2659988403]
["AKY","Sittwe Airport","MM",20.132699966400001,92.872596740700004]
["SNW","Thandwe Airport","MM",18.460699081400001,94.300102233900006]
["THL","Tachileik Airport","MM",20.483800888099999,99.935401916499998]
["XYE","Ye Airport","MM",15.300000190700001,97.866996765099998]
["RGN","Yangon International Airport","MM",16.907300949100001,96.133201599100005]
["TQQ","Maranggo Airport","ID",-5.7645702362,123.9169998169]
["UPG","Hasanuddin International Airport","ID",-5.0616297721999999,119.5540008545]
["BIK","Frans Kaisiepo Airport","ID",-1.1900199652000001,136.10800170900001]
["ONI","Moanamani Airport","ID",-3.9834020138000001,136.0832977295]
["FOO","Kornasoren Airfield","ID",-0.93632501359999998,134.871994019]
["WET","Wagethe Airport","ID",-4.0442299843000002,136.27799987789999]
["NBX","Nabire Airport","ID",-3.3681800365000001,135.49600219729999]
["ILA","Illaga Airport","ID",-3.8332800864999999,137.5829925537]
["KOX","Kokonau Airport","ID",-4.7166671752999996,136.43333435060001]
["ZRI","Serui Airport","ID",-1.8755799531999999,136.24099731449999]
["TIM","Moses Kilangin Airport","ID",-4.5282797813000002,136.8869934082]
["EWI","Enarotali Airport","ID",-3.9258999824999998,136.37699890139999]
["AMI","Selaparang Airport","ID",-8.5607099533,116.095001221]
["BMU","Muhammad Salahuddin Airport","ID",-8.5396499634000005,118.68699646]
["DPS","Ngurah Rai (Bali) International Airport","ID",-8.7481698990000005,115.1669998169]
["LOP","Bandara International Lombok Airport","ID",-8.7573220000000003,116.276675]
["SWQ","Sumbawa Besar Airport","ID",-8.4890403748000001,117.4120025635]
["TMC","Tambolaka Airport","ID",-9.4097204207999994,119.2440032959]
["WGP","Waingapu Airport","ID",-9.6692199707000004,120.302001953]
["YIA","Yogyakarta International Airport","ID",-7.9074590000000002,110.05448]
["ARJ","Arso Airport","ID",-2.9333329200999998,140.7833404541]
["BUI","Bokondini Airport","ID",-3.5836451054,138.53344726559999]
["ZRM","Sarmi Airport","ID",-1.8695499897000001,138.75]
["DJJ","Sentani Airport","ID",-2.5769500731999999,140.51600646969999]
["LHI","Lereh Airport","ID",-3.1278998852000002,139.94299316409999]
["LII","Mulia Airport","ID",-3.7094700336000002,137.9759979248]
["OKL","Oksibil Airport","ID",-5.0910601615999997,140.61000061039999]
["WAR","Waris Airport","ID",-3.2224299907999998,140.97900390629999]
["SEH","Senggeh Airport","ID",-3.4333300591000002,140.81700134280001]
["UBR","Ubrub Airport","ID",-3.6666700840000002,140.85000610349999]
["WMX","Wamena Airport","ID",-4.1025099754000003,138.95700073239999]
["MDP","Mindiptana Airport","ID",-5.75,140.36700439449999]
["BXD","Bade Airport","ID",-7.7146301270000004,139.57499694820001]
["MKQ","Mopah Airport","ID",-8.5202903748000001,140.41799926760001]
["OKQ","Okaba Airport","ID",-8.0882196426000004,139.71899414059999]
["KEI","Kepi Airport","ID",-6.5943698883000001,139.3569946289]
["TMH","Tanah Merah Airport","ID",-6.0992197990000001,140.2980041504]
["TJS","Tanjung Harapan Airport","ID",2.8364100456000001,117.37400054930001]
["DTD","Datadawai Airport","ID",0.626,116.6006]
["BEJ","Barau(Kalimaru) Airport","ID",2.1554999351999999,117.431999207]
["BPN","Sepinggan International Airport","ID",-1.2682700157,116.89399719239999]
["TRK","Juwata Airport","ID",3.3266899585999998,117.5660018921]
["AAP","Aji Pangeran Tumenggung Pranoto International Airport","ID",-0.37361100000000003,117.255556]
["TSX","Tanjung Santan Airport","ID",-9.2973001299999997E-2,117.45300292970001]
["BYQ","Bunyu Airport","ID",3.4557199478,117.866996765]
["GLX","Gamarmalamo Airport","ID",1.8383300304000001,127.7860031128]
["GTO","Jalaluddin Airport","ID",0.63711899520000004,122.8499984741]
["NAH","Naha Airport","ID",3.6832098961000002,125.5279998779]
["TLI","Toli Toli Airport","ID",-1.0297700166999999,120.8170013428]
["GEB","Gebe Airport","ID",-7.8888997399999994E-2,129.4579925537]
["KAZ","Kao Airport","ID",1.1852799653999999,127.89600372309999]
["PLW","Mutiara Airport","ID",-0.91854202750000002,119.9100036621]
["MDC","Sam Ratulangi Airport","ID",1.5492600203,124.9260025024]
["MNA","Melangguane Airport","ID",4.0069398879999998,126.672996521]
["PSJ","Kasiguncu Airport","ID",-1.4167499541999999,120.657997131]
["OTI","Pitu Airport","ID",2.0459899901999998,128.32499694800001]
["TTE","Sultan Khairun Babullah Airport","ID",0.83141398430000002,127.3809967041]
["LUW","Bubung Airport","ID",-1.0389200449,122.7720031738]
["UOL","Buol Airport","ID",1.1590499878,121.4280014038]
["BTW","Batu Licin Airport","ID",-3.4124100207999999,115.995002747]
["PKN","Iskandar Airport","ID",-2.7051999569,111.672996521]
["KBU","Stagen Airport","ID",-3.2947199344999998,116.1650009155]
["TJG","Warukin Airport","ID",-2.2165598868999998,115.435997009]
["BDJ","Syamsudin Noor Airport","ID",-3.4423599242999998,114.76300048829999]
["PKY","Tjilik Riwut Airport","ID",-2.2251300812000001,113.9430007935]
["SMQ","Sampit(Hasan) Airport","ID",-2.4991900921000001,112.9749984741]
["AHI","Amahai Airport","ID",-3.3480000496,128.92599487300001]
["NDA","Banda Airport Kepulauan","ID",5.1166701317000003,97.116699218799994]
["DOB","Dobo Airport","ID",-5.7722201347000004,134.21200561520001]
["MAL","Mangole Airport Falabisahaya","ID",-1.8757900000000001,125.83000183110001]
["NRE","Namrole Airport","ID",-3.8208100796000002,126.7180023193]
["LAH","Oesman Sadik Airport Labuha","ID",-0.63525897259999997,127.5019989014]
["SXK","Saumlaki Airport","ID",-7.9886097908,131.30599975589999]
["BJK","Nangasuri Airport","ID",-6.0661997794999998,134.2740020752]
["LUV","Dumatumbun Airport","ID",-5.6616201401000001,132.73100280759999]
["SQN","Emalamo Sanana Airport","ID",-2.0805099010000001,125.96700286870001]
["AMQ","Pattimura Airport Ambon","ID",-3.7102599143999999,128.0890045166]
["NAM","Namlea Airport","ID",-3.2355699538999998,127.0999984741]
["TAX","Taliabu Island Airport","ID",-1.642629981,124.5589981079]
["WBA","WahaiSeram Island","ID",-2.8141698837,129.4819946289]
["RTU","Maratua Airport","ID",2.1974999999999998,118.59916699999999]
["MLG","Abdul Rachman Saleh Airport","ID",-7.9265599251000003,112.71499633800001]
["CPF","Cepu Airport","ID",-7.1948416667000004,111.548166667]
["JOG","Adi Sutjipto International Airport","ID",-7.7881798743999999,110.4319992065]
["SOC","Adi Sumarmo Wiryokusumo Airport","ID",-7.5160899162000003,110.75700378419999]
["SUB","Juanda International Airport","ID",-7.3798298836000003,112.7870025635]
["SRG","Achmad Yani Airport","ID",-6.9727301598000002,110.375]
["SUP","Trunojoyo Airport","ID",-7.0242500000000003,113.890205556]
["NTI","Stenkol Airport","ID",-2.1041600703999999,133.52200317379999]
["RSK","Abresso Airport","ID",-1.5084500313,134.18699645999999]
["KEQ","Kebar Airport","ID",-0.63710099460000003,133.12800598140001]
["FKQ","Fakfak Airport","ID",-2.9201900958999998,132.26699829099999]
["INX","Inanwatan Airport","ID",-2.1280999183999998,132.1609954834]
["KNG","Kaimana Airport","ID",-3.6445200443000001,133.6959991455]
["RDE","Merdei Airport","ID",-1.5833300351999999,133.3329925537]
["BXB","Babo Airport","ID",-2.5322399138999998,133.43899536129999]
["MKW","Rendani Airport","ID",-0.89183300730000004,134.04899597170001]
["SOQ","Sorong (Jefman) Airport","ID",-0.92635798449999995,131.12100219729999]
["TXM","Teminabuan Airport","ID",-1.4447200298,132.02099609379999]
["WSR","Wasior Airport","ID",-2.7335898876,134.5180053711]
["BJW","Padhameleda Airport","ID",-8.8081398009999994,120.9960021973]
["MOF","Maumere(Wai Oti) Airport","ID",-8.6406497954999999,122.236999512]
["ENE","Ende (H Hasan Aroeboesman) Airport","ID",-8.8492898941,121.66100311300001]
["RTG","Satar Tacik Airport","ID",-8.5970096587999993,120.47699737550001]
["ARD","Mali Airport","ID",-8.1323404311999994,124.5970001221]
["LBJ","Komodo (Mutiara II) Airport","ID",-8.4866600037000008,119.888999939]
["KOE","El Tari Airport","ID",-10.1716003418,123.6709976196]
["BUW","Betoambari Airport","ID",-5.4868798256,122.5690002441]
["MJU","Tampa Padang Airport","ID",-2.5833330000000001,119.033333]
["MXB","Andi Jemma Airport","ID",-2.5580399036000001,120.3239974976]
["KXB","Sangia Nibandera Airport","ID",-4.3412170000000003,121.523983]
["SQR","Soroako Airport","ID",-2.5311999320999998,121.35800170900001]
["TTR","Pongtiku Airport","ID",-3.0447399615999999,119.8219985962]
["KDI","Wolter Monginsidi Airport","ID",-4.0816102028000003,122.4179992676]
["BTU","Bintulu Airport","MY",3.1238501072,113.019996643]
["BLG","Belaga Airport","MY",2.6500000953999998,113.76699829099999]
["LSM","Long Semado Airport","MY",4.2170000076000003,115.599998474]
["LGL","Long Lellang Airport","MY",3.4210000038000001,115.15399932859999]
["KCH","Kuching International Airport","MY",1.4846999645000001,110.3470001221]
["ODN","Long Seridan Airport","MY",3.9670000075999998,115.0500030518]
["LMN","Limbang Airport","MY",4.8083000182999998,115.0100021362]
["MKM","Mukah Airport","MY",2.9063899517,112.08000183110001]
["LKH","Long Akah Airport","MY",3.2999999522999999,114.78299713129999]
["MUR","Marudi Airport","MY",4.1789798737000003,114.3290023804]
["BSE","Sematan Airport","MY",1.8136099577,109.76300048829999]
["KPI","Kapit Airport","MY",2.0169999599000001,112.9499969482]
["BKM","Bakalalan Airport","MY",3.9739999771000001,115.61799621580001]
["MYY","Miri Airport","MY",4.3220100403000004,113.98699951170001]
["SBW","Sibu Airport","MY",2.2616000175000002,111.98500061039999]
["TGC","Tanjung Manis Airport","MY",2.1778399944000002,111.202003479]
["LSU","Long Sukang Airport","MY",4.5522198676999999,115.4940032959]
["LWY","Lawas Airport","MY",4.8491702080000003,115.40799713129999]
["SGG","Simanggang Airport","MY",1.2170000076,111.4499969482]
["BBN","Bario Airport","MY",3.7338900566,115.47899627690001]
["SMM","Semporna Airport","MY",4.4499998093000004,118.5830001831]
["LDU","Lahad Datu Airport","MY",5.0322499274999997,118.3239974976]
["TEL","Telupid Airport","MY",5.6286101340999997,117.12599945069999]
["KGU","Keningau Airport","MY",5.3574900627000002,116.1620025635]
["SXS","Sahabat [Sahabat 16] Airport","MY",5.0877799988000003,119.09400177000001]
["BKI","Kota Kinabalu International Airport","MY",5.9372100830000001,116.0510025024]
["LBU","Labuan Airport","MY",5.3006801604999998,115.25]
["TMG","Tomanggong Airport","MY",5.4000000954000003,118.6500015259]
["GSA","Long Pasia Airport","MY",4.4000000954000003,115.71700286870001]
["SPE","Sepulot Airport","MY",4.7329998016000001,116.46700286870001]
["PAY","Pamol Airport","MY",5.9993000031000001,117.3999176025]
["RNU","Ranau Airport","MY",5.9499998093000004,116.6669998169]
["SDK","Sandakan Airport","MY",5.9008998870999996,118.0589981079]
["KUD","Kudat Airport","MY",6.9225001334999998,116.83599853520001]
["TWU","Tawau Airport","MY",4.3201599121000003,118.12799835209999]
["MZV","Mulu Airport","MY",4.0483298302000001,114.8050003052]
["BWN","Brunei International Airport","BN",4.9442000389,114.9280014038]
["AKQ","Menggala Airport","ID",-4.4894399642999998,105.21700286870001]
["PKU","Sultan Syarif Kasim Ii (Simpang Tiga) Airport","ID",0.46078601479999998,101.4449996948]
["DUM","Pinang Kampai Airport","ID",1.6091899871999999,101.4339981079]
["RKO","Rokot Airport","ID",-2.0991199017,99.700698852499997]
["SEQ","Sungai Pakning Bengkalis Airport","ID",1.3700000048000001,102.13999938960001]
["TJB","Tanjung Balai Airport","ID",1.0499999523000001,103.3830032349]
["KJT","Majalengka Kertajati International Airport","ID",-6.6476863354557096,108.165802638643]
["BDO","Husein Sastranegara International Airport","ID",-6.9006299973000003,107.5759963989]
["CBN","Penggung Airport","ID",-6.7561402320999999,108.540000916]
["TSY","Cibeureum Airport","ID",-7.3466000556999997,108.246002197]
["TKG","Radin Inten II (Branti) Airport","ID",-5.2405559999999998,105.175556]
["BTH","Hang Nadim Airport","ID",1.121029973,104.1190032959]
["PPR","Pasir Pangaraan Airport","ID",0.84543102979999996,100.37000274659999]
["TNJ","Kijang Airport","ID",0.92268300059999997,104.53199768100001]
["SIQ","Dabo Airport","ID",-0.47918900850000001,104.5790023804]
["PDG","Minangkabau Airport","ID",-0.78691697120000004,100.28099822999999]
["HLP","Halim Perdanakusuma International Airport","ID",-6.2666101455999996,106.8909988403]
["CXP","Tunggul Wulung Airport","ID",-7.6450600623999998,109.033996582]
["PCB","Pondok Cabe Air Base","ID",-6.3369598389000004,106.76499938960001]
["PPJ","Pulau Panjang Airport","ID",-5.644444,106.5625]
["CGK","Soekarno-Hatta International Airport","ID",-6.1255698204,106.65599822999999]
["GNS","Binaka Airport","ID",1.1663800477999999,97.704696655299998]
["AEG","Aek Godang Airport","ID",1.4000999928,99.430496215800005]
["MES","Soewondo Air Force Base","ID",3.559167,98.671110999999996]
["KNO","Polonia International Airport","ID",3.5580599307999998,98.671699523900003]
["DTB","Sisingamangaraja XII International Airport","ID",2.259722,98.995277999999999]
["SIW","Parapat Airport","ID",2.6666669846,98.933334350600006]
["FLZ","Dr Ferdinand Lumban Tobing Airport","ID",1.5559400320000001,98.888900756799998]
["TJQ","Buluh Tumbang (H A S Hanandjoeddin) Airport","ID",-2.7457199097,107.754997253]
["NPO","Nanga Pinoh I Airport","ID",-0.34886899589999998,111.7480010986]
["KTG","Ketapang(Rahadi Usman) Airport","ID",-1.8166400194000001,109.9629974365]
["MWK","Tarempa Airport","ID",3.3481199740999998,106.2580032349]
["NTX","Ranai Airport","ID",3.9087100028999999,108.38800048829999]
["PNK","Supadio Airport","ID",-0.15071100000000001,109.40399932859999]
["PSU","Pangsuma Airport","ID",0.83557802439999995,112.93699646]
["SQG","Sintang(Susilo) Airport","ID",6.3619002699999996E-2,111.47299957280001]
["DJB","Sultan Thaha Airport","ID",-1.6380200385999999,103.64399719239999]
["PGK","Pangkal Pinang (Depati Amir) Airport","ID",-2.1621999741,106.138999939]
["BKS","Padang Kemiling (Fatmawati Soekarno) Airport","ID",-3.863699913,102.3389968872]
["PLM","Sultan Mahmud Badaruddin Ii Airport","ID",-2.8982501030000001,104.6999969482]
["PDO","Pendopo Airport","ID",-3.2860701084000001,103.87999725340001]
["RGT","Japura Airport","ID",-0.35280799870000001,102.3349990845]
["MPC","Muko Muko Airport","ID",-2.5418601035999999,101.0879974365]
["KLQ","Keluang Airport","ID",-2.6235299109999999,103.95500183110001]
["TPK","Teuku Cut Ali Airport","ID",3.2634201049999998,97.183799743700007]
["MEQ","Seunagan Airport","ID",4.25,96.217002868700007]
["LSX","Lhok Sukon Airport","ID",5.0695099830999997,97.259201049799998]
["LSW","Malikus Saleh Airport","ID",5.2266798018999996,96.950302124000004]
["SBG","Maimun Saleh Airport","ID",5.8741297721999999,95.339698791499998]
["BTJ","Sultan Iskandarmuda Airport","ID",5.5235199927999998,95.420402526900006]
["SXT","Sungai Tiang Airport","MY",4.3302779198000003,102.3949966431]
["MEP","Mersing Airport","MY",2.3829998969999999,103.8669967651]
["SWY","Sitiawan Airport","MY",4.2163882256000003,100.6986083984]
["TPG","Taiping (Tekah) Airport","MY",4.8670001029999996,100.71700286870001]
["TOD","Pulau Tioman Airport","MY",2.8181800842000002,104.1600036621]
["AOR","Sultan Abdul Halim Airport","MY",6.1896700858999996,100.39800262449999]
["BWH","Butterworth Airport","MY",5.4659199715,100.3909988403]
["KBR","Sultan Ismail Petra Airport","MY",6.1668500899999996,102.2929992676]
["KUA","Kuantan Airport","MY",3.7753899096999999,103.2089996338]
["KTE","Kerteh Airport","MY",4.5372200011999997,103.4270019531]
["IPH","Sultan Azlan Shah Airport","MY",4.5679697990000001,101.09200286870001]
["JHB","Senai International Airport","MY",1.6413099766000001,103.66999816889999]
["KUL","Kuala Lumpur International Airport","MY",2.745579958,101.7099990845]
["LGK","Langkawi International Airport","MY",6.3297300338999998,99.7286987305]
["MKZ","Malacca Airport","MY",2.2633600235000002,102.25199890099999]
["TGG","Sultan Mahmud Airport","MY",5.3826398848999997,103.1029968262]
["PEN","Penang International Airport","MY",5.2971401215,100.27700042719999]
["PKG","Pulau Pangkor Airport","MY",4.2447199821000003,100.5530014038]
["RDN","LTS Pulau Redang Airport","MY",5.7652797699000002,103.00700378419999]
["SZB","Sultan Abdul Aziz Shah International Airport","MY",3.1305799483999999,101.5490036011]
["DTR","Decatur Shores Airport","US",48.499801635700003,-122.814002991]
["AUT","Atauro Airport","TL",-8.2105197905999994,125.61599731450001]
["UAI","Suai Airport","TL",-9.3033103943000004,125.2870025635]
["DIL","Presidente Nicolau Lobato International Airport","TL",-8.5464000702000007,125.526000977]
["BCH","Cakung Airport","TL",-8.4890298843000007,126.401000977]
["MPT","Maliana Airport","TL",-8.9722404480000009,125.2149963379]
["OEC","Oecussi Airport","TL",-9.1980600356999993,124.3430023193]
["VIQ","Viqueque Airport","TL",-8.8837995528999993,126.3730010986]
["ABU","Haliwen Airport","ID",-9.0730495453,124.9049987793]
["LKA","Gewayentana Airport","ID",-8.3466596603000003,122.98100280760001]
["SAU","Sawu Airport","ID",-10.483300208999999,121.9000015259]
["SGQ","Sanggata Airport","ID",0.5,117.33335876460001]
["LBW","Long Bawan Airport","ID",3.8670001030000001,115.6829986572]
["BXT","Bontang Airport","ID",0.1196909994,117.474998474]
["NNX","Nunukan Airport","ID",4.1365299225000003,117.6669998169]
["TNB","Tanah Grogot Airport","ID",-1.9101300240000001,116.202003479]
["LPU","Long Apung Airport","ID",1.7044859999999999,114.970297]
["QPG","Paya Lebar Air Base","SG",1.3604199885999999,103.9100036621]
["TGA","Tengah Air Base","SG",1.3872599602,103.7089996338]
["XSP","Seletar Airport","SG",1.4169499874,103.86799621580001]
["SIN","Singapore Changi International Airport","SG",1.3501900434,103.9940032959]
["SKL","Skye Bridge Ashaig Airport","GB",57.253398895300002,-5.8278999329000003]
["ALH","Albany Airport","AU",-34.943298339800002,117.8089981079]
["ABG","Abingdon Downs Airport","AU",-17.616699218800001,143.16700744600001]
["AWN","Alton Downs Airport","AU",-26.533300399800002,139.26699829099999]
["AUD","Augustus Downs Airport","AU",-18.5149993896,139.87800598140001]
["MRP","Marla Airport","AU",-27.3332996368,133.62699890139999]
["AXL","Alexandria Homestead Airport","AU",-19.0601997375,136.71000671389999]
["AXC","Aramac Airport","AU",-22.966699600199998,145.24200439449999]
["ADO","Andamooka Airport","AU",-30.438299179099999,137.1369934082]
["AMX","Ammaroo Airport","AU",-21.738300323499999,135.24200439449999]
["AMT","Amata Airport","AU",-26.108299255399999,131.20700073239999]
["WLP","West Angelas Airport","AU",-23.1355555556,118.706975]
["AYL","Anthony Lagoon Airport","AU",-18.018079030999999,135.53506851200001]
["ABH","Alpha Airport","AU",-23.6460990906,146.5839996338]
["ARY","Ararat Airport","AU",-37.309398651099997,142.98899841310001]
["GYL","Argyle Airport","AU",-16.636899948100002,128.45100402829999]
["ARM","Armidale Airport","AU",-30.528099060100001,151.61700439500001]
["AAB","Arrabury Airport","AU",-26.7000007629,141.05000305179999]
["AUU","Aurukun Airport","AU",-13.353899955699999,141.720993042]
["AWP","Austral Downs Airport","AU",-20.5,137.75]
["AVG","Auvergne Airport","AU",-15.699999809299999,130]
["AYQ","Ayers Rock Connellan Airport","AU",-25.186100006099998,130.9759979248]
["AYR","Ayr Airport","AU",-19.584400176999999,147.32899475100001]
["ACF","Aral Talim Airport","CN",40.435799163783301,81.264117055346006]
["ABM","Bamaga Injinoo Airport","AU",-10.950799942,142.4589996338]
["BCI","Barcaldine Airport","AU",-23.5652999878,145.307006836]
["ASP","Alice Springs Airport","AU",-23.8066997528,133.90199279789999]
["BDD","Badu Island Airport","AU",-10.149999618500001,142.17339999999999]
["BKP","Barkly Downs Airport","AU",-20.495833333299998,138.474722222]
["BBE","Big Bell Airport","AU",-27.328599929799999,117.672996521]
["BNE","Brisbane International Airport","AU",-27.384199142500002,153.11700439449999]
["OOL","Gold Coast Airport","AU",-28.1644001007,153.505004883]
["BKQ","Blackall Airport","AU",-24.427799224899999,145.42900085400001]
["CNS","Cairns International Airport","AU",-16.885799408,145.755004883]
["CTL","Charleville Airport","AU",-26.4132995605,146.261993408]
["BDW","Bedford Downs Airport","AU",-17.286699294999998,127.462997437]
["BXG","Bendigo Airport","AU",-36.739398956300001,144.330001831]
["BVI","Birdsville Airport","AU",-25.897499084500001,139.34800720210001]
["BXF","Pumululu National Park","AU",-17.545000000000002,128.30500000000001]
["BTX","Betoota Airport","AU",-25.641700744600001,140.78300476070001]
["OCM","Boolgeeda Airport","AU",-22.54,117.27500000000001]
["BQW","Balgo Hill Airport","AU",-20.148300170900001,127.97299957280001]
["BHQ","Broken Hill Airport","AU",-32.001399993900002,141.472000122]
["HTI","Hamilton Island Airport","AU",-20.358100891100001,148.95199585]
["BEU","Bedourie Airport","AU",-24.3460998535,139.46000671389999]
["BIW","Billiluna Airport","AU",-19.566699981700001,127.666999817]
["BZP","Bizant Airport","AU",-14.740277777799999,144.11944444400001]
["BRK","Bourke Airport","AU",-30.039199829099999,145.9519958496]
["BUC","Burketown Airport","AU",-17.748600006099998,139.53399658199999]
["BLN","Benalla Airport","AU",-36.551898956300001,146.00700378420001]
["LCN","Balcanoona Airport","AU",-30.534999847400002,139.33700561520001]
["BLS","Bollon Airport","AU",-28.058300018299999,147.48300170900001]
["BQB","Busselton Regional Airport","AU",-33.688423156699997,115.40159606899999]
["ISA","Mount Isa Airport","AU",-20.663900375400001,139.48899841299999]
["MCY","Sunshine Coast Airport","AU",-26.603300094600002,153.09100341800001]
["MKY","Mackay Airport","AU",-21.171699523899999,149.17999267600001]
["BNK","Ballina Byron Gateway Airport","AU",-28.8339004517,153.56199645999999]
["BSJ","Bairnsdale Airport","AU",-37.887500762899997,147.56799316409999]
["GIC","Boigu Airport","AU",-9.2327804565000005,142.21800231899999]
["OKY","Oakey Airport","AU",-27.4113998413,151.73500061039999]
["BQL","Boulia Airport","AU",-22.9132995605,139.89999389650001]
["BMP","Brampton Island Airport","AU",-20.803300857499998,149.27000427249999]
["PPP","Proserpine Whitsunday Coast Airport","AU",-20.495000839199999,148.552001953]
["ROK","Rockhampton Airport","AU",-23.381900787399999,150.47500610399999]
["BOX","Borroloola Airport","AU",-16.075300216700001,136.30200195309999]
["BME","Broome International Airport","AU",-17.944700241100001,122.2320022583]
["BZD","Balranald Airport","AU",-34.623600006099998,143.57800292970001]
["BTD","Brunette Downs Airport","AU",-18.6399993896,135.93800354000001]
["BWQ","Brewarrina Airport","AU",-29.9738998413,146.81700134280001]
["BYP","Barimunya Airport","AU",-22.6739006042,119.1660003662]
["BHS","Bathurst Airport","AU",-33.409400939900003,149.65199279800001]
["BRT","Bathurst Island Airport","AU",-11.769200325,130.61999511720001]
["TSV","Townsville Airport","AU",-19.252500534100001,146.76499938960001]
["BLT","Blackwater Airport","AU",-23.603099823000001,148.80700683590001]
["BDB","Bundaberg Airport","AU",-24.9039001465,152.31900024399999]
["BUY","Bunbury Airport","AU",-33.378299713099999,115.6770019531]
["BIP","Bulimba Airport","AU",-16.8808002472,143.479003906]
["ZBO","Bowen Airport","AU",-20.0182991028,148.2149963379]
["WEI","Weipa Airport","AU",-12.6786003113,141.92500305199999]
["WTB","Toowoomba Wellcamp Airport","AU",-27.558333000000001,151.79333299999999]
["BWB","Barrow Island Airport","AU",-20.8644008636,115.40599822999999]
["BVZ","Beverley Springs Airport","AU",-16.733299255399999,125.4329986572]
["CGV","Caiguna Airport","AU",-32.2649993896,125.49299621580001]
["CLH","Coolah Airport","AU",-31.773300170900001,149.61000061039999]
["CVQ","Carnarvon Airport","AU",-24.880599975599999,113.67199707029999]
["CSI","Casino Airport","AU",-28.8827991486,153.06700134280001]
["CAZ","Cobar Airport","AU",-31.5382995605,145.79400634769999]
["COJ","Coonabarabran Airport","AU",-31.332500457799998,149.26699829099999]
["CBY","Canobie Airport","AU",-19.479400634800001,140.927001953]
["CBI","Cape Barren Island Airport","AU",-40.391700744600001,148.01699829099999]
["CPD","Coober Pedy Airport","AU",-29.040000915499999,134.720993042]
["CRB","Collarenebri Airport","AU",-29.521699905399998,148.58200073239999]
["CCL","Chinchilla Airport","AU",-26.774999618500001,150.61700439449999]
["CNC","Coconut Island Airport","AU",-10.050000190700001,143.07000732419999]
["CNJ","Cloncurry Airport","AU",-20.668600082400001,140.503997803]
["CBX","Condobolin Airport","AU",-33.064399719199997,147.2089996338]
["CUD","Caloundra Airport","AU",-26.7999992371,153.10000610349999]
["CED","Ceduna Airport","AU",-32.130599975599999,133.71000671389999]
["CVC","Cleve Airport","AU",-33.709701538099999,136.50500488279999]
["CFI","Camfield Airport","AU",-17.021699905399998,131.3269958496]
["LLG","Chillagoe Airport","AU",-17.142799377399999,144.529006958]
["CKW","Graeme Rowley Aerodrome","AU",-22.355556,119.65222199999999]
["CXT","Charters Towers Airport","AU",-20.043100357099998,146.27299499509999]
["DCN","RAAF Base Curtin","AU",-17.581399917599999,123.82800293]
["CKI","Croker Island Airport","AU",-11.1649999619,132.48300170900001]
["CTN","Cooktown Airport","AU",-15.4447002411,145.1840057373]
["CMQ","Clermont Airport","AU",-22.7730998993,147.62100219729999]
["CMA","Cunnamulla Airport","AU",-28.030000686600001,145.62199401859999]
["CML","Camooweal Airport","AU",-19.911699294999998,138.125]
["NIF","Camp Nifty Airport","AU",-21.671699523899999,121.5869979858]
["CES","Cessnock Airport","AU",-32.787498474099998,151.34199523929999]
["CNB","Coonamble Airport","AU",-30.983299255399999,148.37600708010001]
["ODL","Cordillo Downs Airport","AU",-26.745300293,140.63800048830001]
["CUQ","Coen Airport","AU",-13.760800361599999,143.11399841310001]
["CIE","Collie Airport","AU",-33.366699218800001,116.21700286870001]
["OOM","Cooma Snowy Mountains Airport","AU",-36.3005981445,148.973999023]
["CDA","Cooinda Airport","AU",-12.9033002853,132.53199768069999]
["CWW","Corowa Airport","AU",-35.994701385500001,146.3569946289]
["CYG","Corryong Airport","AU",-36.182800293,147.88800048830001]
["CXQ","Christmas Creek Station Airport","AU",-18.883300781300001,125.9169998169]
["CDQ","Croydon Airport","AU",-18.225000381499999,142.25799560550001]
["KCE","Collinsville Airport","AU",-20.596700668299999,147.86000061039999]
["CMD","Cootamundra Airport","AU",-34.623901367199998,148.02799987789999]
["CUG","Cudal Airport","AU",-33.278301239000001,148.76300048830001]
["CUY","Cue Airport","AU",-27.446699142500002,117.9179992676]
["CJF","Coondewanna Wa Airport","AU",-22.966667000000001,118.802222]
["CWR","Cowarie Airport","AU",-27.7117004395,138.32800292970001]
["CCW","Cowell Airport","AU",-33.666698455800002,136.89199829099999]
["CWT","Cowra Airport","AU",-33.844699859599999,148.6490020752]
["COY","Coolawanyah Airport","AU",-21.783300399800002,117.8000030518]
["DJR","Dajarra Airport","AU",-21.7082996368,139.53300476070001]
["DBY","Dalby Airport","AU",-27.155300140400001,151.26699829099999]
["DRN","Dirranbandi Airport","AU",-28.591699600199998,148.21699523929999]
["DNB","Dunbar Airport","AU",-16.0499992371,142.39999389650001]
["DRB","Derby Airport","AU",-17.370000839199999,123.6610031128]
["DFP","Drumduff Airport","AU",-16.0529994965,143.011993408]
["DGD","Dalgaranga Gold Mine Airport","AU",-27.830277777799999,117.316388889]
["DXD","Dixie Airport","AU",-15.117494434799999,143.31604957600001]
["DKI","Dunk Island Airport","AU",-17.941699981700001,146.13999938960001]
["DLK","Dulkaninna Airport","AU",-29.013299942,138.48100280759999]
["DNQ","Deniliquin Airport","AU",-35.559398651099997,144.94599914599999]
["DDN","Delta Downs Airport","AU",-16.991699218800001,141.31700134280001]
["DLV","Delissaville Airport","AU",-12.550000190700001,130.6849975586]
["DYW","Daly Waters Airport","AU",-16.264695066400002,133.383378983]
["DMD","Doomadgee Airport","AU",-17.9402999878,138.82200622560001]
["DVR","Daly River Airport","AU",-13.749806404099999,130.69387817379999]
["NLF","Darnley Island Airport","AU",-9.5833301544000005,143.76699829099999]
["DRD","Dorunda Airport","AU",-16.558300018299999,141.80799865719999]
["DVP","Davenport Downs Airport","AU",-24.149999618500001,141.10800170900001]
["DPO","Devonport Airport","AU",-41.169700622599997,146.42999267600001]
["DOX","Dongara Airport","AU",-29.2999992371,114.932998657]
["DRY","Drysdale River Airport","AU",-15.7135703992,126.38109684]
["DHD","Durham Downs Airport","AU",-27.0750007629,141.89999389650001]
["DRR","Durrie Airport","AU",-25.684999465899999,140.22799682620001]
["DKV","Docker River Airport","AU",-24.8600006104,129.07000732419999]
["DYA","Dysart Airport","AU",-22.6222000122,148.36399841310001]
["ECH","Echuca Airport","AU",-36.157199859599999,144.7619934082]
["EUC","Eucla Airport","AU",-31.7000007629,128.88299560550001]
["ETD","Etadunna Airport","AU",-28.740800857499998,138.5890045166]
["ENB","Eneabba Airport","AU",-29.832500457799998,115.2460021973]
["EIH","Einasleigh Airport","AU",-18.503299713099999,144.093994141]
["ELC","Elcho Island Airport","AU",-12.0193996429,135.57099914599999]
["EMD","Emerald Airport","AU",-23.567499160800001,148.17900085400001]
["ERB","Ernabella Airport","AU",-26.263299942,132.18200683590001]
["EPR","Esperance Airport","AU",-33.684398651099997,121.8229980469]
["EVD","Eva Downs Airport","AU",-18.0009994507,134.863006592]
["EVH","Evans Head Aerodrome","AU",-29.093299865700001,153.41999816890001]
["EXM","Exmouth Airport","AU",-22.033300399800002,114.0999984741]
["FRB","Forbes Airport","AU",-33.363601684599999,147.93499755900001]
["KFE","Fortescue - Dave Forrest Aerodrome","AU",-22.291944000000001,119.43722200000001]
["FLY","Finley Airport","AU",-35.666698455800002,145.55000305199999]
["FLS","Flinders Island Airport","AU",-40.0917015076,147.99299621579999]
["FVL","Flora Valley Airport","AU",-18.283300399800002,128.41700744600001]
["FIK","Finke Airport","AU",-25.594699859599999,134.58299255399999]
["FOS","Forrest Airport","AU",-30.838100433299999,128.11500549319999]
["FOT","Forster (Wallis Is) Airport","AU",-32.204200744600001,152.47900390629999]
["FIZ","Fitzroy Crossing Airport","AU",-18.181900024400001,125.5589981079]
["GBP","Gamboola Airport","AU",-16.5499992371,143.6670074463]
["GAH","Gayndah Airport","AU",-25.6144008636,151.6190032959]
["GBL","South Goulburn Is Airport","AU",-11.649999618500001,133.38200378420001]
["GUH","Gunnedah Airport","AU",-30.961099624599999,150.25100708010001]
["GOO","Goondiwindi Airport","AU",-28.5214004517,150.32000732419999]
["GDD","Gordon Downs Airport","AU",-18.678100585900001,128.59199523929999]
["GGD","Gregory Downs Airport","AU",-18.625,139.23300170900001]
["GTS","The Granites Airport","AU",-20.548299789400001,130.34700012210001]
["GET","Geraldton Airport","AU",-28.796100616499999,114.7070007324]
["GFN","Grafton Airport","AU",-29.759399414099999,153.0299987793]
["GBW","Ginbata","AU",-22.578665999999998,120.03940900000001]
["GBV","Gibb River Airport","AU",-16.423299789400001,126.4449996948]
["GKL","Great Keppel Is Airport","AU",-23.183300018299999,150.94200134280001]
["GLT","Gladstone Airport","AU",-23.869699478099999,151.22300720199999]
["GUL","Goulburn Airport","AU",-34.810298919700003,149.7259979248]
["GLG","Glengyle Airport","AU",-24.808300018299999,139.60000610349999]
["GEX","Geelong Airport","AU",-38.224998474099998,144.3329925537]
["GLI","Glen Innes Airport","AU",-29.6749992371,151.68899536129999]
["GLM","Glenormiston Airport","AU",-22.888299942,138.82499694820001]
["GVP","Greenvale Airport","AU",-18.983299255399999,145.11700439449999]
["GPN","Garden Point Airport","AU",-11.4025001526,130.42199707029999]
["GYZ","Gruyere Mine Airport","AU",-28.033991199999999,123.8140464]
["GSC","Gascoyne Junction Airport","AU",-25.0499992371,115.1999969482]
["GTE","Groote Eylandt Airport","AU",-13.975000381499999,136.460006714]
["GFF","Griffith Airport","AU",-34.250801086400003,146.06700134299999]
["GTT","Georgetown Airport","AU",-18.3050003052,143.5299987793]
["GEE","Georgetown (Tas) Airport","AU",-41.080001831099999,146.8399963379]
["GYP","Gympie Airport","AU",-26.282800674400001,152.7019958496]
["HWK","Wilpena Pound Airport","AU",-31.855907440199999,138.46807861330001]
["HXX","Hay Airport","AU",-34.531398773200003,144.83000183109999]
["HVB","Hervey Bay Airport","AU",-25.318899154699999,152.880004883]
["HUB","Humbert River Airport","AU",-16.489669799800001,130.63027954099999]
["HRY","Henbury Airport","AU",-24.5499992371,133.21699523929999]
["HIP","Headingly Airport","AU",-21.3332996368,138.28300476070001]
["HIG","Highbury Airport","AU",-16.433300018299999,143.14999389650001]
["HID","Horn Island Airport","AU",-10.586400032,142.289993286]
["HLL","Hillside Airport","AU",-21.75,119.4169998169]
["HCQ","Halls Creek Airport","AU",-18.233900070200001,127.66999816889999]
["HMG","Hermannsburg Airport","AU",-23.9300003052,132.80499267580001]
["HLT","Hamilton Airport","AU",-37.648899078399999,142.0650024414]
["HOK","Hooker Creek Airport","AU",-18.3367004395,130.63800048830001]
["MHU","Mount Hotham Airport","AU",-37.0475006104,147.33399963400001]
["HTU","Hopetoun Airport","AU",-35.715301513699998,142.36000061039999]
["HSM","Horsham Airport","AU",-36.669700622599997,142.1730041504]
["HAT","Heathlands Airport","AU",-11.75,142.5829925537]
["HGD","Hughenden Airport","AU",-20.815000534100001,144.22500610349999]
["IDK","Indulkana Airport","AU",-26.966699600199998,133.32499694820001]
["IFL","Innisfail Airport","AU",-17.559400558499998,146.0119934082]
["IFF","Iffley Airport","AU",-18.899999618500001,141.21699523929999]
["IGH","Ingham Airport","AU",-18.6606006622,146.15199279789999]
["IKP","Inkerman Airport","AU",-16.274999618500001,141.44200134280001]
["INJ","Injune Airport","AU",-25.850000381499999,148.53300476070001]
["INM","Innamincka Airport","AU",-27.7000007629,140.73300170900001]
["IVW","Inverway Airport","AU",-17.8411006927,129.64300537099999]
["ISI","Isisford Airport","AU",-24.258300781300001,144.42500305179999]
["IVR","Inverell Airport","AU",-29.888299942,151.14399719240001]
["JAB","Jabiru Airport","AU",-12.6583003998,132.8930053711]
["JUN","Jundah Airport","AU",-24.841699600199998,143.05799865719999]
["QJD","Jindabyne Airport","AU",-36.426700592000003,148.60200500490001]
["JCK","Julia Creek Airport","AU",-20.668300628699999,141.72300720210001]
["JUR","Jurien Bay Airport","AU",-30.2999992371,115.03299713129999]
["UBU","Kalumburu Airport","AU",-14.2882995605,126.63200378419999]
["KDB","Kambalda Airport","AU",-31.183300018299999,121.5999984741]
["KAX","Kalbarri Airport","AU",-27.690000534100001,114.2620010376]
["KBY","Streaky Bay Airport","AU",-32.835800170900001,134.29299926760001]
["KBJ","Kings Canyon Airport","AU",-24.260000228900001,131.49000549319999]
["KCS","Kings Creek Airport","AU",-24.423299789400001,131.83500671389999]
["OOD","Gudai-Darri Airstrip","AU",-22.503574253549001,119.07625111164]
["KRA","Kerang Airport","AU",-35.751399993900002,143.93899536129999]
["KNS","King Island Airport","AU",-39.877498626700003,143.87800598140001]
["KBB","Kirkimbie Station Airport","AU",-17.779199600199998,129.210006714]
["KFG","Kalkgurung Airport","AU",-17.431900024400001,130.80799865719999]
["KOH","Koolatah Airport","AU",-15.9167003632,142.44999694820001]
["KKP","Koolburra Airport","AU",-15.318900108299999,143.95500183109999]
["KRB","Karumba Airport","AU",-17.456699371300001,140.83000183109999]
["KML","Kamileroi Airport","AU",-19.375,140.05700683590001]
["KPS","Kempsey Airport","AU",-31.074399948100002,152.77000427249999]
["KNI","Katanning Airport","AU",-33.7167015076,117.6330032349]
["KWM","Kowanyama Airport","AU",-15.4856004715,141.75100708010001]
["KPP","Kalpowar Airport","AU",-14.899999618500001,144.19999694820001]
["KGY","Kingaroy Airport","AU",-26.5807991028,151.84100341800001]
["KGC","Kingscote Airport","AU",-35.713901519799997,137.52099609379999]
["KUG","Kubin Airport","AU",-10.225000381499999,142.21800231930001]
["LWH","Lawn Hill Airport","AU",-18.5683002472,138.63499450680001]
["LGH","Leigh Creek Airport","AU",-30.598300933800001,138.42599487300001]
["LNO","Leonora Airport","AU",-28.878099441500002,121.3150024414]
["LEL","Lake Evella Airport","AU",-12.498900413499999,135.80599975589999]
["LFP","Lakefield Airport","AU",-14.933300018300001,144.19999694820001]
["LDH","Lord Howe Island Airport","AU",-31.5382995605,159.07699585]
["IRG","Lockhart River Airport","AU",-12.786899566700001,143.30499267580001]
["LTP","Lyndhurst Airport","AU",-19.195800781199999,144.371002197]
["LDC","Lindeman Island Airport","AU",-20.453599929799999,149.039993286]
["LSY","Lismore Airport","AU",-28.830299377399999,153.25999450699999]
["LNH","Lake Nash Airport","AU",-20.966699600199998,137.9170074463]
["LKD","Lakeland Airport","AU",-15.8332996368,144.85000610349999]
["LOC","Lock Airport","AU",-33.5442008972,135.69299316409999]
["LOA","Lorraine Airport","AU",-18.9932994843,139.90699768069999]
["LTV","Lotus Vale Airport","AU",-17.048299789400001,141.37600707999999]
["LUU","Laura Airport","AU",-15.550000190700001,144.44999694820001]
["LHG","Lightning Ridge Airport","AU",-29.456699371300001,147.98399353030001]
["LRE","Longreach Airport","AU",-23.434200286900001,144.27999877900001]
["LUT","New Laura Airport","AU",-15.183300018300001,144.36700439449999]
["LER","Leinster Airport","AU",-27.843299865700001,120.70300292970001]
["LVO","Laverton Airport","AU",-28.613599777200001,122.4240036011]
["TGN","Latrobe Valley Airport","AU",-38.207199096700002,146.47000122099999]
["LZR","Lizard Island Airport","AU",-14.6667003632,145.44999694820001]
["UBB","Mabuiag Island Airport","AU",-9.9499998092999995,142.18299865719999]
["AVV","Avalon Airport","AU",-38.039398193399997,144.468994141]
["ABX","Albury Airport","AU",-36.067798614499999,146.9579925537]
["MRG","Mareeba Airport","AU",-17.0692005157,145.41900634769999]
["MBB","Marble Bar Airport","AU",-21.1632995605,119.8330001831]
["XMC","Mallacoota Airport","AU",-37.598300933799997,149.7200012207]
["MFP","Manners Creek Airport","AU",-22.100000381499999,137.98300170900001]
["MLR","Millicent Airport","AU",-37.583599090600003,140.36599731449999]
["DGE","Mudgee Airport","AU",-32.5625,149.61099243199999]
["MQA","Mandora Airport","AU",-19.738300323499999,120.837997437]
["MNW","Macdonald Downs Airport","AU",-22.466699600199998,135.23300170900001]
["MKR","Meekatharra Airport","AU",-26.611700058,118.547996521]
["MEB","Melbourne Essendon Airport","AU",-37.728099823000001,144.90199279789999]
["MIM","Merimbula Airport","AU",-36.9085998535,149.901000977]
["SXE","West Sale Airport","AU",-38.0917015076,146.96499633799999]
["MLV","Merluna Airport","AU",-13.050000190700001,142.48300170900001]
["MGT","Milingimbi Airport","AU",-12.0944004059,134.893997192]
["MNG","Maningrida Airport","AU",-12.056099891700001,134.23399352999999]
["GSN","Mount Gunson Airport","AU",-31.459699630700001,137.17399597170001]
["MGV","Margaret River (Station) Airport","AU",-18.621700286900001,126.883003235]
["MQZ","Margaret River Airport","AU",-33.930599212600001,115.099998474]
["MVU","Musgrave Airport","AU",-14.7833003998,143.5]
["HBA","Hobart International Airport","AU",-42.836101532000001,147.50999450699999]
["MHO","Mount House Airport","AU",-17.0550003052,125.7099990845]
["MCV","McArthur River Mine Airport","AU",-16.442499160800001,136.08399963400001]
["MQL","Mildura Airport","AU",-34.229198455800002,142.08599853499999]
["XML","Minlaton Airport","AU",-34.75,137.53300476070001]
["MIH","Mitchell Plateau Airport","AU",-14.791399955699999,125.8239974976]
["MWY","Miralwyn Airport","AU",-30.149999618500001,147.33500671389999]
["MTQ","Mitchell Airport","AU",-26.483299255399999,147.93699645999999]
["MJP","Manjimup Airport","AU",-34.2653007507,116.13999938960001]
["WLE","Miles Airport","AU",-26.808300018299999,150.17500305179999]
["LST","Launceston Airport","AU",-41.545299530000001,147.21400451700001]
["MBW","Melbourne Moorabbin Airport","AU",-37.9757995605,145.10200500490001]
["WUI","Murrin Murrin Airport","AU",-28.705299377399999,121.8909988403]
["MEL","Melbourne International Airport","AU",-37.673301696800003,144.84300231930001]
["MMM","Middlemount Airport","AU",-22.802499771099999,148.70500183109999]
["MTL","Maitland Airport","AU",-32.703300476099997,151.488006592]
["WME","Mount Keith Airport","AU",-27.2863998413,120.5550003052]
["ONR","Monkira Airport","AU",-24.816699981700001,140.53300476070001]
["MSF","Mount Swan Airport","AU",-22.600000381499999,135.01699829099999]
["OXY","Morney Airport","AU",-25.358299255399999,141.43299865719999]
["MMG","Mount Magnet Airport","AU",-28.116100311299999,117.84200286870001]
["OOR","Mooraberree Airport","AU",-25.25,140.98300170900001]
["MRZ","Moree Airport","AU",-29.4988994598,149.84500122099999]
["MET","Moreton Airport","AU",-12.4441995621,142.63800048799999]
["MIN","Minnipa Airport","AU",-32.843299865699997,135.14500427249999]
["MQE","Marqua Airport","AU",-22.8057994843,137.25100708010001]
["MOV","Moranbah Airport","AU",-22.057800293,148.07699585]
["RRE","Marree Airport","AU",-29.6632995605,138.0650024414]
["MWB","Morawa Airport","AU",-29.201700210599999,116.0220031738]
["MYA","Moruya Airport","AU",-35.897800445599998,150.143997192]
["MTD","Mount Sanford Station Airport","AU",-16.978300094600002,130.55499267580001]
["UTB","Muttaburra Airport","AU",-22.5832996368,144.53300476070001]
["MGB","Mount Gambier Airport","AU",-37.7456016541,140.7850036621]
["ONG","Mornington Island Airport","AU",-16.662500381499999,139.17799377439999]
["MNQ","Monto Airport","AU",-24.885799408,151.10000610349999]
["MUQ","Muccan Station Airport","AU",-20.6588993073,120.0670013428]
["MNE","Mungeranie Airport","AU",-28.009199142500002,138.65699768069999]
["MYI","Murray Island Airport","AU",-9.9166698455999995,144.05499267580001]
["MVK","Mulka Airport","AU",-28.3477993011,138.64999389650001]
["MUP","Mulga Park Airport","AU",-25.899999618500001,131.6670074463]
["MKV","Mount Cavenagh Airport","AU",-25.966699600199998,133.19999694820001]
["MXU","Mullewa Airport","AU",-28.475000381499999,115.51699829099999]
["MWT","Moolawatana Airport","AU",-29.9167003632,139.75]
["MXD","Marion Downs Airport","AU",-23.366699218800001,139.6670074463]
["MBH","Maryborough Airport","AU",-25.513299942,152.7149963379]
["MYO","Myroodan Station Airport","AU",-18.116699218800001,124.26699829099999]
["RTY","Merty Merty Airport","AU",-28.5832996368,140.31700134280001]
["NMR","Nappa Merrie Airport","AU",-27.558300018299999,141.13299560550001]
["NRA","Narrandera Airport","AU",-34.702201843300003,146.511993408]
["NAA","Narrabri Airport","AU",-30.3192005157,149.82699585]
["RPM","Ngukurr Airport","AU",-14.722800254799999,134.74699401859999]
["NBH","Nambucca Heads Airport","AU",-30.649999618500001,153]
["NLS","Nicholson Airport","AU",-18.0499992371,128.89999389650001]
["NAC","Naracoorte Airport","AU",-36.985298156699997,140.72500610349999]
["NRG","Narrogin Airport","AU",-32.930000305199997,117.08000183110001]
["QRM","Narromine Airport","AU",-32.214698791499998,148.22500610349999]
["RVT","Ravensthorpe Airport","AU",-33.7971992493,120.208000183]
["NSV","Noosa Airport","AU",-26.423299789400001,153.06300354000001]
["NSM","Norseman Airport","AU",-32.209999084499998,121.75499725340001]
["NTN","Normanton Airport","AU",-17.683599472000001,141.07000732419999]
["NUR","Nullabor Motel Airport","AU",-31.441699981700001,130.90199279789999]
["NLL","Nullagine Airport","AU",-21.9132995605,120.1979980469]
["NUB","Numbulwar Airport","AU",-14.2716999054,135.71699523929999]
["ZNE","Newman Airport","AU",-23.417800903300002,119.803001404]
["NYN","Nyngan Airport","AU",-31.551099777200001,147.20300292970001]
["OPI","Oenpelli Airport","AU",-12.324999809299999,133.0059967041]
["XCO","Colac Airport","AU",-38.286701202400003,143.67999267580001]
["OLP","Olympic Dam Airport","AU",-30.4850006104,136.87699890100001]
["ONS","Onslow Airport","AU",-21.668300628699999,115.1129989624]
["ODD","Oodnadatta Airport","AU",-27.561700820900001,135.44700622560001]
["MOO","Moomba Airport","AU",-28.099399566700001,140.19700622560001]
["RBS","Orbost Airport","AU",-37.790000915500002,148.61000061039999]
["OAG","Orange Airport","AU",-33.381698608400001,149.13299560499999]
["ODR","Ord River Airport","AU",-17.340799331700001,128.91200256350001]
["OSO","Osborne Mine Airport","AU",-22.081699371300001,140.55499267600001]
["OYN","Ouyen Airport","AU",-35.089012426799997,142.35448837300001]
["ADL","Adelaide International Airport","AU",-34.944999694800003,138.53100585940001]
["PUG","Port Augusta Airport","AU",-32.506900787399999,137.71699523929999]
["PMK","Palm Island Airport","AU",-18.755300521900001,146.58099365230001]
["PBO","Paraburdoo Airport","AU",-23.171100616499999,117.745002747]
["CCK","Cocos (Keeling) Islands Airport","CC",-12.1883001328,96.833900451700003]
["PDE","Pandie Pandie Airport","AU",-26.116699218800001,139.39999389650001]
["DRW","Darwin International Airport","AU",-12.4146995544,130.87699890139999]
["PRD","Pardoo Airport","AU",-20.1175003052,119.5899963379]
["BEO","Aeropelican Airport","AU",-33.066699981699998,151.64799499509999]
["GOV","Gove Airport","AU",-12.2693996429,136.817993164]
["PPI","Port Pirie Airport","AU",-33.238899230999998,137.99499511720001]
["JAD","Perth Jandakot Airport","AU",-32.097499847400002,115.8809967041]
["KTA","Karratha Airport","AU",-20.712200164799999,116.773002625]
["KGI","Kalgoorlie Boulder Airport","AU",-30.7894001007,121.461997986]
["PKE","Parkes Airport","AU",-33.131401062000002,148.23899841299999]
["PKT","Port Keats Airport","AU",-14.25,129.529006958]
["KNX","Kununurra Airport","AU",-15.7781000137,128.70799255399999]
["PLO","Port Lincoln Airport","AU",-34.605300903299998,135.880004883]
["LEA","Learmonth Airport","AU",-22.235599517800001,114.08899688699999]
["EDR","Pormpuraaw Airport","AU",-14.8966999054,141.60899353030001]
["PQQ","Port Macquarie Airport","AU",-31.4358005524,152.863006592]
["PTJ","Portland Airport","AU",-38.318099975599999,141.470993042]
["MBF","Porepunkah Airport","AU",-36.717730706200001,146.890039444]
["PHE","Port Hedland International Airport","AU",-20.3777999878,118.625999451]
["PER","Perth International Airport","AU",-31.9402999878,115.96700286870001]
["PEA","Penneshaw Airport","AU",-35.755846287399997,137.96287536599999]
["KTR","Tindal Airport","AU",-14.521100044300001,132.37800598140001]
["UMR","Woomera Airfield","AU",-31.144199371300001,136.81700134280001]
["XCH","Christmas Island Airport","CX",-10.450599670400001,105.6900024414]
["UIR","Quirindi Airport","AU",-31.490600585900001,150.51400756839999]
["ULP","Quilpie Airport","AU",-26.612199783299999,144.25300598140001]
["UEE","Queenstown Airport","AU",-42.075000762899997,145.53199768069999]
["RMK","Renmark Airport","AU",-34.196399688699998,140.67399597170001]
["RCM","Richmond Airport","AU",-20.701900482199999,143.11500549319999]
["RAM","Ramingining Airport","AU",-12.3563995361,134.89799499509999]
["ROH","Robinhood Airport","AU",-18.844999313399999,143.71000671389999]
["RBU","Roebourne Airport","AU",-20.761699676500001,117.15699768100001]
["RBC","Robinvale Airport","AU",-34.650001525900002,142.78300476070001]
["RMA","Roma Airport","AU",-26.545000076299999,148.77499389600001]
["RPB","Roper Bar Airport","AU",-14.738300323500001,134.5180053711]
["RSB","Roseberth Airport","AU",-25.8332996368,139.64999389650001]
["RTS","Rottnest Island Airport","AU",-32.006698608400001,115.5400009155]
["RTP","Rutland Plains Airport","AU",-15.643300056499999,141.84300231930001]
["RHL","Roy Hill Station Airport","AU",-22.625815890999998,119.95903015099999]
["NDS","Sandstone Airport","AU",-27.979999542200002,119.29699707029999]
["BWU","Sydney Bankstown Airport","AU",-33.924400329599997,150.9880065918]
["CBR","Canberra International Airport","AU",-35.306900024400001,149.19500732419999]
["CFS","Coffs Harbour Airport","AU",-30.320600509599998,153.115997314]
["CDU","Camden Airport","AU",-34.040298461900001,150.68699645999999]
["NSO","Scone Airport","AU",-32.037200927699999,150.83200073239999]
["SQC","Southern Cross Airport","AU",-31.239999771099999,119.36000061039999]
["DBO","Dubbo City Regional Airport","AU",-32.2167015076,148.57499694800001]
["SGO","St George Airport","AU",-28.049699783299999,148.5950012207]
["SIX","Singleton Airport","AU",-32.600831999999997,151.19305600000001]
["ZGL","South Galway Airport","AU",-25.683300018299999,142.10800170900001]
["SGP","Shay Gap Airport","AU",-20.424699783299999,120.1409988403]
["MJK","Shark Bay Airport","AU",-25.893899917599999,113.577003479]
["JHQ","Shute Harbour Airport","AU",-20.278299331700001,148.75700378420001]
["SHT","Shepparton Airport","AU",-36.428901672400002,145.3930053711]
["SBR","Saibai Island Airport","AU",-9.3783302306999996,142.625]
["SIO","Smithton Airport","AU",-40.834999084499998,145.0839996338]
["SHU","Smith Point Airport","AU",-11.149999618500001,132.14999389600001]
["STH","Strathmore Airport","AU",-17.850000381499999,142.56700134280001]
["SNB","Snake Bay Airport","AU",-11.4228000641,130.654006958]
["NLK","Norfolk Island International Airport","NF",-29.041599273700001,167.93899536129999]
["NOA","Nowra Airport","AU",-34.948898315400001,150.53700256350001]
["SLJ","Solomon Airport","AU",-22.255278000000001,117.761944]
["SNH","Stanthorpe Airport","AU",-28.620300293,151.99099731449999]
["SCG","Spring Creek Airport","AU",-18.633300781300001,144.56700134280001]
["SHQ","Southport Airport","AU",-27.915000915499999,153.37300109860001]
["KSV","Springvale Airport","AU",-23.5499992371,140.69999694820001]
["XRH","RAAF Base Richmond","AU",-33.600601196299998,150.78100585940001]
["SRN","Strahan Airport","AU",-42.154998779300001,145.2920074463]
["SYD","Sydney Kingsford Smith International Airport","AU",-33.946098327599998,151.17700195309999]
["HLS","St Helens Airport","AU",-41.3367004395,148.28199768069999]
["TMW","Tamworth Airport","AU",-31.0839004517,150.847000122]
["WGA","Wagga Wagga City Airport","AU",-35.165298461900001,147.46600341800001]
["SWH","Swan Hill Airport","AU",-35.375801086400003,143.53300476070001]
["SWC","Stawell Airport","AU",-37.071701049799998,142.74099731449999]
["XTR","Tara Airport","AU",-27.156700134299999,150.47700500490001]
["TBL","Tableland Homestead Airport","AU",-17.283300399800002,126.900001526]
["XTO","Taroom Airport","AU",-25.801700592,149.89999389650001]
["TAQ","Tarcoola Airport","AU",-30.703300476100001,134.58399963400001]
["TBK","Timber Creek Airport","AU",-15.6199998856,130.44500732419999]
["TDR","Theodore Airport","AU",-24.9932994843,150.09300231930001]
["TQP","Trepell Airport","AU",-21.834999084500001,140.88800048830001]
["TEF","Telfer Airport","AU",-21.715000152599998,122.22899627690001]
["TEM","Temora Airport","AU",-34.421398162800003,147.5119934082]
["TAN","Tangalooma Airport","AU",-27.129999160800001,153.363006592]
["XTG","Thargomindah Airport","AU",-27.9864006042,143.81100463870001]
["TDN","Theda Station Airport","AU",-14.788100242600001,126.4960021973]
["TYG","Thylungra Airport","AU",-26.0832996368,143.46699523929999]
["TYB","Tibooburra Airport","AU",-29.4510993958,142.05799865719999]
["TKY","Turkey Creek Airport","AU",-17.040800094600002,128.20599365199999]
["PHQ","The Monument Airport","AU",-21.811100006099998,139.92399597170001]
["TPR","Tom Price Airport","AU",-22.7460002899,117.869003296]
["TUM","Tumut Airport","AU",-35.262798309300003,148.24099731449999]
["TYP","Tobermorey Airport","AU",-22.2558002472,137.95300292970001]
["THG","Thangool Airport","AU",-24.493900299100002,150.57600402829999]
["TCA","Tennant Creek Airport","AU",-19.634399414099999,134.18299865719999]
["TCW","Tocumwal Airport","AU",-35.811698913599997,145.60800170900001]
["TRO","Taree Airport","AU",-31.8885993958,152.51400756800001]
["TTX","Truscott Mungalalu Airport","AU",-14.089699745200001,126.3809967041]
["TWB","Toowoomba Airport","AU",-27.542800903300002,151.9160003662]
["UDA","Undara Airport","AU",-18.2000007629,144.60000610349999]
["CZY","Cluny Airport","AU",-24.516700744600001,139.61700439449999]
["USL","Useless Loop Airport","AU",-26.1667003632,113.4000015259]
["VCD","Victoria River Downs Airport","AU",-16.4021244049,131.00497436520001]
["VNR","Vanrook Station Airport","AU",-16.963300705000002,141.94999694820001]
["WLA","Wallal Airport","AU",-19.773599624599999,120.649002075]
["WAV","Wave Hill Airport","AU",-17.3932991028,131.11799621579999]
["WMB","Warrnambool Airport","AU",-38.295299530000001,142.44700622560001]
["SYU","Warraber Island Airport","AU",-10.2082996368,142.82499694820001]
["WIO","Wilcannia Airport","AU",-31.526399612399999,143.375]
["WLC","Walcha Airport","AU",-31,151.56700134280001]
["WAZ","Warwick Airport","AU",-28.1494007111,151.94299316409999]
["WND","Windarra Airport","AU",-28.475000381499999,122.241996765]
["WNR","Windorah Airport","AU",-25.4130992889,142.6670074463]
["WON","Wondoola Airport","AU",-18.5750007629,140.89199829099999]
["WGT","Wangaratta Airport","AU",-36.415798187299998,146.30700683590001]
["WYA","Whyalla Airport","AU",-33.058898925800001,137.51400756839999]
["WSY","Whitsunday Island Airport","AU",-20.266700744600001,148.76699829099999]
["WIT","Wittenoom Airport","AU",-22.218299865700001,118.34799957280001]
["WKB","Warracknabeal Airport","AU",-36.321098327599998,142.41900634769999]
["WGE","Walgett Airport","AU",-30.032800674400001,148.12600708010001]
["NTL","Newcastle Airport","AU",-32.794998168900001,151.8339996338]
["WUN","Wiluna Airport","AU",-26.629199981700001,120.22100067140001]
["WPK","Wrotham Park Airport","AU",-16.658300399800002,144.00199890139999]
["WDI","Wondai Airport","AU",-26.283300399800002,151.85800170900001]
["WOL","Wollongong Airport","AU",-34.561100006099998,150.78900146480001]
["WLL","Wollogorang Airport","AU",-17.219999313399999,137.9230041504]
["QRR","Warren Airport","AU",-31.733299255399999,147.80299377439999]
["WLO","Waterloo Airport","AU",-16.629999160800001,129.32000732419999]
["WIN","Winton Airport","AU",-22.363599777200001,143.08599853519999]
["WUD","Wudinna Airport","AU",-33.043300628700003,135.44700622560001]
["WEW","Wee Waa Airport","AU",-30.258300781300001,149.40800476070001]
["WRW","Warrawagine Airport","AU",-20.846459651499998,120.70532798799999]
["WWI","Woodie Woodie Airport","AU",-21.662799835200001,121.2340011597]
["WWY","West Wyalong Airport","AU",-33.9371986389,147.19099426299999]
["WYN","Wyndham Airport","AU",-15.511400222800001,128.15299987789999]
["BWT","Wynyard Airport","AU",-40.998901367199998,145.73100280759999]
["YLG","Yalgoo Airport","AU",-28.355300903300002,116.683998108]
["OKR","Yorke Island Airport","AU",-9.7570295334000008,143.4109954834]
["KYF","Yeelirrie Airport","AU",-27.277060037799998,120.095672607]
["XMY","Yam Island Airport","AU",-9.9011096954000006,142.77600097659999]
["YUE","Yuendumu Airport","AU",-22.254199981700001,131.78199768069999]
["NGA","Young Airport","AU",-34.255599975599999,148.24800109860001]
["ORR","Yorketown Airport","AU",-35,137.61700439449999]
["KYI","Yalata Mission Airport","AU",-31.470600128200001,131.82499694820001]
["PEK","Beijing Capital International Airport","CN",40.0801010132,116.5849990845]
["PKX","Beijing Daxing International Airport","CN",39.509166999999998,116.410556]
["AXF","Alxa Left Banner Bayanhot Airport","CN",38.748309999999996,105.58857999999999]
["RHT","Alxa Right Banner Badanjilin Airport","CN",39.225000000000001,101.54600000000001]
["CIF","Chifeng Airport","CN",42.2350006104,118.90799713129999]
["CIH","Changzhi Airport","CN",36.247501373299997,113.12599945069999]
["DSN","Ordos Ejin Horo Airport","CN",39.49,109.861388889]
["DAT","Datong Airport","CN",40.060298919700003,113.4820022583]
["EJN","Ejina Banner Taolai Airport","CN",42.015555999999997,101.000556]
["ERL","Erenhot Saiwusu International Airport","CN",43.422499999999999,112.09666666699999]
["YIE","Aershan Yiershi Airport","CN",47.310555999999998,119.91194400000001]
["AEB","Tian Yang Air Base","CN",23.720600128200001,106.959999084]
["HDG","Handan Airport","CN",36.5258333333,114.42555555600001]
["HET","Baita International Airport","CN",40.851398467999999,111.823997498]
["HUO","Huolinguole Huolinhe Airport","CN",45.487222000000003,119.407222]
["HLD","Dongshan Airport","CN",49.205001831099999,119.82499694800001]
["NZH","Manzhouli Xijiao Airport","CN",49.566667000000002,117.33]
["NAY","Beijing Nanyuan Airport","CN",39.782798767099997,116.38800048829999]
["BAV","Baotou Airport","CN",40.560001373299997,109.99700164790001]
["SHP","Shanhaiguan Airport","CN",39.968101501500001,119.731002808]
["SJW","Shijiazhuang Daguocun International Airport","CN",38.280700683600003,114.6969985962]
["TSN","Tianjin Binhai International Airport","CN",39.124401092500001,117.346000671]
["TGO","Tongliao Airport","CN",43.556701660199998,122.1999969482]
["UCB","Ulanqab Jining Airport","CN",41.129722000000001,113.108056]
["WUA","Wuhai Airport","CN",39.791944000000001,106.80333299999999]
["HLH","Ulanhot Airport","CN",46.195332999999998,122.00833299999999]
["XIL","Xilinhot Airport","CN",43.915599823000001,115.9639968872]
["YCU","Yuncheng Guangong Airport","CN",35.116391,111.031388889]
["TYN","Taiyuan Wusu Airport","CN",37.746898651099997,112.62799835209999]
["RLK","Bayannaoer Tianjitai Airport","CN",40.926389,107.738889]
["NZL","Zhalantun Chengjisihan Airport","CN",47.865833000000002,122.7675]
["BHY","Beihai Airport","CN",21.5394001007,109.2939987183]
["CGD","Changde Airport","CN",28.9188995361,111.63999939]
["HJJ","Zhijiang Airport","CN",27.4411111111,109.7]
["HCZ","Chenzhou Beihu Airport","CN",25.753213880638398,112.84496305822501]
["DYG","Dayong Airport","CN",29.102800369299999,110.4430007935]
["FUO","Foshan Shadi Airport","CN",23.0832996368,113.06999969500001]
["CAN","Guangzhou Baiyun International Airport","CN",23.392400741599999,113.2990036011]
["CSX","Changsha Huanghua Airport","CN",28.1891994476,113.2200012207]
["HNY","Hengyang Airport","CN",26.905300140400001,112.62799835209999]
["HUZ","Huizhou Airport","CN",23.0499992371,114.599998474]
["KWL","Guilin Liangjiang International Airport","CN",25.2180995941,110.03900146479999]
["LLF","Lingling Airport","CN",26.338660999999998,111.610043]
["MXZ","Meixian Airport","CN",24.350000381499999,116.1330032349]
["NNG","Nanning Wuxu Airport","CN",22.608299255399999,108.17199707029999]
["SWA","Shantou Waisha Airport","CN",23.4269008636,116.7620010376]
["ZUH","Zhuhai Airport","CN",22.006399154699999,113.37599945069999]
["SZX","Shenzhen Bao'an International Airport","CN",22.6392993927,113.8109970093]
["WUZ","Wuzhou Xijiang Airport","CN",23.401389000000002,111.09861100000001]
["XIN","Xingning Airport","CN",24.1492004395,115.7580032349]
["YLX","Yulin Fumian Airport","CN",22.438056,110.120833]
["YYA","Yueyang Sanhe Airport","CN",29.314,113.27800000000001]
["LZH","Bailian Airport","CN",24.207500457799998,109.3909988403]
["ZHA","Zhanjiang Airport","CN",21.2143993378,110.35800170900001]
["AYN","Anyang Airport","CN",36.133899688699998,114.34400177000001]
["CGO","Xinzheng Airport","CN",34.519699096700002,113.841003418]
["EHU","Ezhou Huahu Airport","CN",30.342856000000001,115.029611]
["ENH","Enshi Airport","CN",30.3202991486,109.48500061]
["LHK","Guangzhou MR Air Base","CN",32.389400482200003,111.6949996948]
["WUH","Wuhan Tianhe International Airport","CN",30.783800125100001,114.2080001831]
["LYA","Luoyang Airport","CN",34.741100311300002,112.388000488]
["NNY","Nanyang Airport","CN",32.980800628700003,112.6149978638]
["SHS","Shashi Airport","CN",30.324399948100002,112.28099822999999]
["XFN","Xiangfan Airport","CN",32.150600433299999,112.2910003662]
["XAI","Xinyang Minggang Airport","CN",32.541389000000002,114.077778]
["YIH","Yichang Airport","CN",30.556549722,111.47998833299999]
["HAK","Haikou Meilan International Airport","CN",19.934900283800001,110.4589996338]
["BAR","Qionghai Boao Airport","CN",19.140556,110.458889]
["SYX","Sanya Phoenix International Airport","CN",18.3029003143,109.4120025635]
["RGO","Orang Airport","KP",41.428100585899998,129.64700317399999]
["FNJ","Sunan International Airport","KP",39.224098205600001,125.66999816889999]
["DSO","Sondok Airport","KP",39.745201110799997,127.473999023]
["YJS","Samjiyon Airport","KP",41.9058990479,128.41000366200001]
["AKA","Ankang Airport","CN",32.708099365199999,108.9309997559]
["DNH","Dunhuang Airport","CN",40.161098480200003,94.8091964722]
["GOQ","Golmud Airport","CN",36.400600433299999,94.786102294900004]
["GYU","Guyuan Liupanshan Airport","CN",36.078888888900003,106.21694444400001]
["HBQ","Haibei Qilian Airport","CN",38.012,100.64400000000001]
["HZG","Hanzhong Airport","CN",33.063598632800002,107.0080032349]
["INC","Yinchuan Airport","CN",38.481899261499997,106.00900268549999]
["JIC","Jinchuan Airport","CN",38.542222222200003,102.348333333]
["JNG","Jining Da'an Airport","CN",35.6474564984983,116.74408951599101]
["JGN","Jiayuguan Airport","CN",39.856899261499997,98.341400146500007]
["LHW","Lanzhou Zhongchuan Airport","CN",36.515201568599998,103.620002747]
["LNL","Longnan Chengxian Airport","CN",33.787999999999997,105.797]
["IQN","Qingyang Airport","CN",35.799701690699997,107.6029968262]
["SIA","Xiguan Airport","CN",34.376701355000002,109.12000274659999]
["THQ","Tianshui Maijishan Airport","CN",34.559398651099997,105.86000061]
["XNN","Xining Caojiabu Airport","CN",36.527500152599998,102.0429992676]
["XIY","Xi'an Xianyang International Airport","CN",34.447101592999999,108.7519989014]
["ENY","Yan'an Airport","CN",36.6369018555,109.5540008545]
["UYN","Yulin Airport","CN",38.269199371299997,109.73100280760001]
["ZHY","Zhongwei Shapotou Airport","CN",37.572778,105.154444]
["AVK","Arvaikheer Airport","MN",46.2503013611,102.8020019531]
["LTI","Altai Airport","MN",46.376399993900002,96.221099853499993]
["BYN","Bayankhongor Airport","MN",46.1632995605,100.7040023804]
["UGA","Bulgan Airport","MN",48.854999542199998,103.4759979248]
["UGT","Bulagtai Resort Airport","MN",43.749304182000003,104.11498546599999]
["HBU","Bulgan Sum Airport","MN",46.100601196299998,91.584197997999993]
["UUN","Baruun Urt Airport","MN",46.660301208500002,113.2850036621]
["COQ","Choibalsan Airport","MN",48.135700225800001,114.64600372309999]
["UBN","Chinggis Khaan International Airport","MN",47.651581,106.821772]
["DLZ","Dalanzadgad Airport","MN",43.5917015076,104.4300003052]
["KHR","Kharkhorin Airport","MN",47.246667000000002,102.826111]
["HJT","Khujirt Airport","MN",46.925800323499999,102.77300262449999]
["HVD","Khovd Airport","MN",47.9541015625,91.628196716299996]
["MXV","Moron Airport","MN",49.6632995605,100.0989990234]
["ULN","Chinggis Khaan International Airport","MN",47.843101501500001,106.76699829099999]
["ULO","Ulaangom Airport","MN",49.973332999999997,92.079722000000004]
["ULG","Ulgii Mongolei Airport","MN",48.993301391599999,89.922500610399993]
["BSD","Baoshan Yunduan Airport","CN",25.053300857499998,99.168296814000001]
["DLU","Dali Airport","CN",25.6494007111,100.3190002441]
["DIG","Diqing Airport","CN",27.793600082400001,99.677200317399993]
["JHG","Xishuangbanna Gasa Airport","CN",21.9738998413,100.7600021362]
["LNJ","Lincang Airport","CN",23.738333000000001,100.02500000000001]
["LJG","Lijiang Airport","CN",26.6800003052,100.246002197]
["LUM","Mangshi Airport","CN",24.4011001587,98.531700134299996]
["KMG","Kunming Wujiaba International Airport","CN",24.992399215700001,102.7440032959]
["SYM","Simao Airport","CN",22.793300628699999,100.9589996338]
["ZAT","Zhaotong Airport","CN",27.325599670399999,103.75499725340001]
["XMN","Xiamen Gaoqi International Airport","CN",24.544000625599999,118.12799835209999]
["AQG","Anqing Airport","CN",30.582199096699998,117.0500030518]
["BFU","Bengbu Airport","CN",32.847733333299999,117.320244444]
["CZX","Changzhou Airport","CN",31.919700622600001,119.77899932859999]
["KHN","Nanchang Changbei International Airport","CN",28.864999771099999,115.9000015259]
["DOY","Dongying Shengli Airport","CN",37.508598327599998,118.788002014]
["FUG","Fuyang Xiguan Airport","CN",32.882156999999999,115.734364]
["FOC","Fuzhou Changle International Airport","CN",25.935100555399998,119.6630020142]
["JGS","Jinggangshan Airport","CN",26.856899261500001,114.736999512]
["KOW","Ganzhou Airport","CN",25.825799942,114.912002563]
["HGH","Hangzhou Xiaoshan International Airport","CN",30.229499816899999,120.4339981079]
["JDZ","Jingdezhen Airport","CN",29.3386001587,117.176002502]
["JIU","Jiujiang Lushan Airport","CN",29.476944,115.80111100000001]
["TNA","Yaoqiang Airport","CN",36.857200622599997,117.216003418]
["JUZ","Quzhou Airport","CN",28.965799331700001,118.8990020752]
["LCX","Longyan Guanzhishan Airport","CN",25.674699783299999,116.74700164799999]
["LYG","Lianyungang Airport","CN",34.571666999999998,118.873611]
["HYN","Huangyan Luqiao Airport","CN",28.562200546300001,121.4290008545]
["LYI","Shubuling Airport","CN",35.046100616499999,118.4120025635]
["NGB","Ningbo Lishe International Airport","CN",29.826700210599999,121.4619979858]
["NKG","Nanjing Lukou Airport","CN",31.742000579799999,118.86199951170001]
["NTG","Nantong Airport","CN",32.070800781199999,120.975997925]
["HFE","Hefei Xinqiao International Airport","CN",31.988980000000002,116.96380000000001]
["PVG","Shanghai Pudong International Airport","CN",31.1434001923,121.8050003052]
["TAO","Qingdao Jiaodong International Airport","CN",36.361944000000001,120.08833300000001]
["JJN","Quanzhou Airport","CN",24.796400070200001,118.5899963379]
["RUG","Rugao Air Base","CN",32.2578849792,120.50165557859999]
["HIA","Lianshui Airport","CN",33.7908333333,119.125]
["SQJ","Sanming Shaxian Airport","CN",26.428056000000002,117.845]
["SHA","Shanghai Hongqiao International Airport","CN",31.197900772099999,121.33599853520001]
["SZV","Guangfu Airport","CN",31.263099670399999,120.4010009766]
["TXN","Tunxi International Airport","CN",29.733299255399999,118.2559967041]
["WHA","Wuhu Xuanzhou Airport","CN",31.104444000000001,118.667222]
["WEF","Weifang Airport","CN",36.646701812700002,119.1190032959]
["WEH","Weihai Airport","CN",37.187099456799999,122.22899627690001]
["WHU","Wuhu Air Base","CN",31.3906002045,118.408996582]
["WUX","Sunan Shuofang International Airport","CN",31.494400024400001,120.42900085399999]
["WUS","Nanping Wuyishan Airport","CN",27.701900482199999,118.00099945069999]
["WNZ","Wenzhou Yongqiang Airport","CN",27.912200927699999,120.85199737550001]
["XUZ","Xuzhou Guanyin Airport","CN",34.059055999999998,117.555278]
["YHJ","Nanchang Yaohu Airport","CN",28.700972,116.107694]
["YNZ","Yancheng Airport","CN",33.425832999999997,120.203056]
["YNT","Yantai Laishan Airport","CN",37.401699066200003,121.37200164790001]
["YIW","Yiwu Airport","CN",29.344699859599999,120.03199768100001]
["HSN","Zhoushan Airport","CN",29.934200286900001,122.361999512]
["NGQ","Ngari Gunsa Airport","CN",32.1,80.053055555599997]
["AVA","Anshun Huangguoshu Airport","CN",26.2605555556,105.87333333300001]
["BPX","Qamdo Bangda Airport","CN",30.553600311299999,97.108299255399999]
["BFJ","Bijie Feixiong Airport","CN",27.266667000000002,105.479167]
["BZX","Bazhong Enyang Airport","CN",31.738,106.645]
["CKG","Chongqing Jiangbei International Airport","CN",29.719200134299999,106.64199829099999]
["DCY","Daocheng Yading Airport","CN",29.323056000000001,100.05333299999999]
["DDR","Rikaze Dingri Airport","CN",28.602499999999999,86.810299999999998]
["DAX","Dachuan Airport","CN",31.130199999999999,107.4295]
["GYS","Guangyuan Airport","CN",32.391101837199997,105.702003479]
["KWE","Longdongbao Airport","CN",26.538499832199999,106.8010025024]
["GZG","Garze Gesar Airport","CN",31.7575,99.554167000000007]
["JZH","Jiuzhai Huanglong Airport","CN",32.8533333333,103.68222222199999]
["KJH","Kaili Huangping Airport","CN",26.974820000000001,107.98694999999999]
["LZG","Langzhong Gucheng Airport","CN",31.50366,106.03534999999999]
["LLB","Qiannan Libo Airport","CN",25.452500000000001,107.96166700000001]
["LIA","Liangping Airport","CN",30.679399490400002,107.7860031128]
["LXA","Lhasa Gonggar Airport","CN",29.297800064099999,90.911903381299993]
["LZO","Luzhou Airport","CN",28.852199554399999,105.3929977417]
["WMT","Zunyi Maotai Airport","CN",27.968056000000001,106.438889]
["MIG","Mianyang Airport","CN",31.428100585900001,104.74099731450001]
["NAO","Nanchong Airport","CN",30.795449999999999,106.1626]
["HZH","Qiandongnan Liping Airport","CN",26.322778,109.151667]
["LZY","Nyingchi Airport","CN",29.303300857499998,94.335296630900004]
["LPF","Liupanshui Yuezhao Airport","CN",26.609417000000001,104.979]
["JIQ","Qianjiang Wulingshan Airport","CN",29.514558999999998,108.833714999999]
["TCZ","Tengchong Tuofeng Airport","CN",24.938055555599998,98.485833333299993]
["TFU","Chengdu Tianfu International Airport","CN",30.318999999999999,104.44499999999999]
["TEN","Tongren Fenghuang Airport","CN",27.883333,109.30888899999999]
["CTU","Chengdu Shuangliu International Airport","CN",30.578500747700001,103.9469985962]
["CQW","Wulong Chongqing Xiannvshan Airport","CN",29.465833,107.692222]
["WSK","Wushan Chongqing Airport","CN",31.064,109.706]
["WXN","Wanxian Airport","CN",30.8017,108.43300000000001]
["XIC","Xichang Qingshan Airport","CN",27.989099502599998,102.1839981079]
["YBP","Yibin Wuliangye Airport","CN",28.858000000000001,104.52500000000001]
["ACX","Xingyi Airport","CN",25.0863888889,104.959444444]
["ZYI","Zunyi Xinzhou Airport","CN",27.589500000000001,107.00069999999999]
["AKU","Aksu Airport","CN",41.262500762899997,80.291702270499997]
["AAT","Altay Air Base","CN",47.749885559100001,88.085807800300003]
["BPL","Alashankou Bole (Bortala) airport","CN",44.895000000000003,82.3]
["IQM","Qiemo Airport","CN",38.149398803700002,85.532798767100005]
["HMI","Hami Airport","CN",42.8414001465,93.669197082500006]
["KCA","Kuqa Airport","CN",41.718101501500001,82.986900329600005]
["KRL","Korla Airport","CN",41.697799682599999,86.128898620599998]
["KRY","Karamay Airport","CN",45.466549999999998,84.952699999999993]
["RQA","Ruoqiang Loulan Airport","CN",38.974722,88.008332999999993]
["KHG","Kashgar Airport","CN",39.542900085399999,76.019996643100001]
["SXJ","Shanshan Airport","CN",42.911701202400003,90.247497558600003]
["TCG","Tacheng Airport","CN",46.6725006104,83.340797424300007]
["HQL","Tashkurgan Khunjerab Airport","CN",37.662709999999997,75.292270000000002]
["HTN","Hotan Airport","CN",37.038501739499999,79.864898681599996]
["TWC","Tumxuk Tangwangcheng Airport","CN",39.888139000000002,79.231910999999997]
["URC","Urumqi Diwopu International Airport","CN",43.907100677499997,87.474197387700002]
["YIN","Yining Airport","CN",43.9557991028,81.330299377399996]
["YTW","Yutian Wanfang Airport","CN",36.810833000000002,81.780833000000001]
["AOG","Anshan Air Base","CN",41.105300903299998,122.85399627690001]
["NBS","Baishan Changbaishan Airport","CN",42.066389000000001,127.606667]
["CGQ","Longjia Airport","CN",43.996200561499997,125.684997559]
["CNI","Changhai Airport","CN",39.266666666699997,122.66694444399999]
["CHG","Chaoyang Airport","CN",41.538101196299998,120.4349975586]
["DDG","Dandong Airport","CN",40.024700164800002,124.28600311300001]
["DQA","Saertu Airport","CN",46.7463888889,125.140555556]
["HRB","Taiping Airport","CN",45.623401641800001,126.25]
["HEK","Heihe Airport","CN",50.171620937100002,127.308883667]
["JIL","Jilin Airport","CN",44.002201080299997,126.39600372309999]
["JMU","Jiamusi Airport","CN",46.8433990479,130.46499633799999]
["JNZ","Jinzhou Airport","CN",41.101398467999999,121.06199646]
["LDS","Lindu Airport","CN",47.752055555600002,129.019125]
["YUS","Yushu Batang Airport","CN",32.836388888899997,97.036388888900007]
["MDG","Mudanjiang Hailang International Airport","CN",44.524101257300003,129.56900024399999]
["OHE","Gu-Lian Airport","CN",52.912777777800002,122.43]
["NDG","Qiqihar Sanjiazi Airport","CN",47.239601135299999,123.9179992676]
["YSQ","Songyuan Chaganhu Airport","CN",44.938113999999999,124.550178]
["DLC","Zhoushuizi Airport","CN",38.965698242199998,121.53900146479999]
["TNH","Tonghua Sanyuanpu Airport","CN",42.253888888900001,125.703333333]
["SHE","Taoxian Airport","CN",41.639801025399997,123.48300170900001]
["XEN","Xingcheng Air Base","CN",40.580299377400003,120.697998047]
["YNJ","Yanji Chaoyangchuan Airport","CN",42.882801055900003,129.451004028]
["Honiara","Honiara International Airport","SB",-9.4280004501000008,160.05499267580001]
["Yaren District","Nauru International Airport","NR",-0.547458,166.919006]
["Port Moresby","Port Moresby Jacksons International Airport","PG",-9.4433803558000005,147.2200012207]
["Wewak","Wewak International Airport","PG",-3.5838301181999999,143.66900634800001]
["Reykjavik","Keflavik International Airport","IS",63.9850006104,-22.605600357099998]
["Prishtina","Pristina International Airport","KS",42.572799682599999,21.035800933800001]
["Edmonton","Edmonton International Airport","CA",53.309700012199997,-113.580001831]
["Riviere Rouge","La Macaza / Mont-Tremblant International Inc Airport","CA",46.409400939900003,-74.779998779300001]
["Hamilton","John C. Munro Hamilton International Airport","CA",43.173599243200002,-79.934997558600003]
["Halifax","Halifax / Stanfield International Airport","CA",44.880798339800002,-63.508598327599998]
["Montreal","Montreal International (Mirabel) Airport","CA",45.679500579799999,-74.038696289100002]
["Ottawa","Ottawa Macdonald-Cartier International Airport","CA",45.322498321499999,-75.669197082500006]
["Quebec","Quebec Jean Lesage International Airport","CA",46.791099548299997,-71.393302917499994]
["Moncton","Greater Moncton International Airport","CA",46.112201690699997,-64.678596496599994]
["Regina","Regina International Airport","CA",50.431900024400001,-104.6660003662]
["Gander","Gander International Airport","CA",48.936901092500001,-54.568099975599999]
["Montreal","Montreal / Pierre Elliott Trudeau International Airport","CA",45.470600128199997,-73.740798950200002]
["Vancouver","Vancouver International Airport","CA",49.193901062000002,-123.1839981079]
["Winnipeg","Winnipeg / James Armstrong Richardson International Airport","CA",49.909999847400002,-97.239898681599996]
["Saskatoon","Saskatoon John G. Diefenbaker International Airport","CA",52.170799255399999,-106.6999969482]
["Whitehorse","Whitehorse / Erik Nielsen International Airport","CA",60.709598541299997,-135.06700134299999]
["Calgary","Calgary International Airport","CA",51.113899230999998,-114.0199966431]
["Victoria","Victoria International Airport","CA",48.646900176999999,-123.4260025024]
["St. John's","St. John's International Airport","CA",47.618598937999998,-52.751899719199997]
["Toronto","Lester B. Pearson International Airport","CA",43.677200317400001,-79.630599975600006]
["Constantine","Mohamed Boudiaf International Airport","DZ",36.276000976600002,6.6203899383999998]
["Accra","Kotoka International Airport","GH",5.6051898002999998,-0.1667860001]
["Abuja","Nnamdi Azikiwe International Airport","NG",9.0067901610999996,7.2631697654999998]
["Asaba","Asaba International Airport","NG",6.2033333332999998,6.6588888889]
["Calabar","Margaret Ekpo International Airport","NG",4.9760198593,8.3472003936999997]
["Enegu","Akanu Ibiam International Airport","NG",6.4742698669000003,7.5619602202999996]
["Gombe","Gombe Lawanti International Airport","NG",10.2983333333,10.896388888900001]
["Ilorin","Ilorin International Airport","NG",8.4402103424000003,4.4939198494000001]
["Owerri","Sam Mbakwe International Airport","NG",5.4270601272999999,7.2060298920000001]
["Kano","Mallam Aminu International Airport","NG",12.0475997925,8.5246200561999999]
["Maiduguri","Maiduguri International Airport","NG",11.855299949600001,13.0809001923]
["Lagos","Murtala Muhammed International Airport","NG",6.5773701667999998,3.3211600780000001]
["Port Harcourt","Port Harcourt International Airport","NG",5.0154900550999999,6.9495902060999999]
["Sokoto","Sadiq Abubakar III International Airport","NG",12.916299819900001,5.2071900368000001]
["Enfidha","Enfidha Zine El Abidine Ben Ali International Airport","TN",36.075833000000003,10.438611]
["Niamey","Diori Hamani International Airport","NE",13.4814996719,2.1836099624999998]
["Agadez","Mano Dayak International Airport","NE",16.965999603299998,8.0001096725000007]
["Monastir","Monastir Habib Bourguiba International Airport","TN",35.758098602300002,10.754699707]
["Tunis","Tunis Carthage International Airport","TN",36.851001739499999,10.2271995544]
["Gafsa","Gafsa Ksar International Airport","TN",34.422000885000003,8.8225002288999992]
["Gabes","Gabes Matmata International Airport","TN",33.876899719199997,10.1033000946]
["Djerba","Djerba Zarzis International Airport","TN",33.875,10.775500297500001]
["Sfax","Sfax Thyna International Airport","TN",34.717998504599997,10.690999984699999]
["Tozeur","Tozeur Nefta International Airport","TN",33.939701080299997,8.1105604172000003]
["Niamtougou","Niamtougou International Airport","TG",9.7673301696999992,1.0912499428]
["Antwerp","Antwerp International Airport (Deurne)","BE",51.189399719199997,4.4602799415999996]
["Ostend","Ostend-Bruges International Airport","BE",51.198898315400001,2.8622200488999998]
["Frankfurt","Frankfurt am Main International Airport","DE",50.026401519799997,8.5431299210000002]
["Frankfurt-am-Main","Frankfurt am Main International Airport","DE",50.026401519799997,8.5431299210000002]
["Dusseldorf","Dusseldorf International Airport","DE",51.289501190199999,6.7667798996000004]
["Munich","Munich International Airport","DE",48.353801727300002,11.786100387599999]
["Berlin","Berlin-Tegel International Airport","DE",52.559700012199997,13.287699699399999]
["Belfast","Belfast International Airport","GB",54.657501220699999,-6.2158298492000004]
["Birmingham","Birmingham International Airport","GB",52.453899383500001,-1.7480299473000001]
["Cardiff","Cardiff International Airport","GB",51.396701812700002,-3.3433299065000002]
["Bristol","Bristol International Airport","GB",51.382701873800002,-2.7190899849000001]
["Manston","Kent International Airport","GB",51.342201232900003,1.3461099862999999]
["Blackpool","Blackpool International Airport","GB",53.771701812700002,-3.0286099911000002]
["Glasgow","Glasgow International Airport","GB",55.871898651099997,-4.4330601692]
["Norwich","Norwich International Airport","GB",52.675800323499999,1.2827800512]
["Exeter","Exeter International Airport","GB",50.734401702900001,-3.4138898849000001]
["Luxembourg","Luxembourg-Findel International Airport","LU",49.626598358199999,6.2115201950000003]
["Krakow","John Paul II International Airport Krakow-Balice Airport","PL",50.077701568599998,19.784799575800001]
["Katowice","Katowice International Airport","PL",50.474300384499998,19.079999923700001]
["Liepaja","Liepaja International Airport","LV",56.517501831099999,21.096900939899999]
["Riga","Riga International Airport","LV",56.923599243200002,23.9710998535]
["Ventspils","Ventspils International Airport","LV",57.357799530000001,21.5442008972]
["Kaunas","Kaunas International Airport","LT",54.963901519799997,24.084800720200001]
["Palanga","Palanga International Airport","LT",55.973201751700003,21.093900680499999]
["Siauliai","Siauliai International Airport","LT",55.893901825,23.395000457799998]
["Vilnius","Vilnius International Airport","LT",54.634101867699997,25.285800933800001]
["Bloemfontain","J B M Hertzog International Airport","ZA",-29.092699050899999,26.302400589000001]
["Cape Town","Cape Town International Airport","ZA",-33.964801788300001,18.601699829099999]
["Mpumalanga","Kruger Mpumalanga International Airport","ZA",-25.383199691800002,31.105600357099998]
["Durban","King Shaka International Airport","ZA",-29.6144444444,31.1197222222]
["Mafeking","Mmabatho International Airport","ZA",-25.798400878900001,25.548000335699999]
["Johannesburg","O. R. Tambo International Airport","ZA",-26.133333,28.25]
["Pilanesberg","Pilanesberg International Airport","ZA",-25.333799362200001,27.173400878900001]
["Potgietersrus","Polokwane International Airport","ZA",-23.845300674400001,29.4585990906]
["Gaborone","Sir Seretse Khama International Airport","BW",-24.555200576800001,25.9181995392]
["Bangui","Bangui M'Poko International Airport","CF",4.3984799385000004,18.518800735500001]
["Port Louis","Sir Seewoosagur Ramgoolam International Airport","MU",-20.430200576800001,57.683601379400002]
["Douala","Douala International Airport","CM",4.0060801505999999,9.7194795609]
["Garoua","Garoua International Airport","CM",9.3358898162999999,13.370100021400001]
["Yaounde","Yaounde Nsimalen International Airport","CM",3.7225599289,11.553299903899999]
["Lusaka","Lusaka International Airport","ZM",-15.330800056499999,28.452600479099999]
["Ndola","Simon Mwansa Kapwepwe International Airport","ZM",-12.961667,28.516667000000002]
["Moroni","Prince Said Ibrahim International Airport","KM",-11.533699989300001,43.271900176999999]
["Dzaoudzi","Dzaoudzi Pamandzi International Airport","YT",-12.804699897800001,45.281101226799997]
["Luanda","Dr. Antonio Agostinho Neto International Airport","AO",-9.0467779999999998,13.507194]
["Franceville","M'Vengue El Hadj Omar Bongo Ondimba International Airport","GA",-1.6561599970000001,13.437999725299999]
["Sao Tome","Sao Tome International Airport","ST",0.37817499040000002,6.7121500969000003]
["Mahe Island","Seychelles International Airport","SC",-4.6743397712999997,55.521800994899998]
["N'Djamena","N'Djamena International Airport","TD",12.1337003708,15.0340003967]
["Bulawayo","Joshua Mqabuko Nkomo International Airport","ZW",-20.017400741599999,28.617900848400001]
["Victoria Falls","Victoria Falls International Airport","ZW",-18.095899581899999,25.839000701900002]
["Harare","Harare International Airport","ZW",-17.931800842299999,31.092800140400001]
["Kariba","Kariba International Airport","ZW",-16.519800186200001,28.885000228900001]
["Masvingo","Masvingo International Airport","ZW",-20.055299758899999,30.859100341800001]
["Blantyre","Chileka International Airport","MW",-15.6791000366,34.973999023399998]
["Lilongwe","Lilongwe International Airport","MW",-13.7894001007,33.780998230000002]
["Maseru","Moshoeshoe I International Airport","LS",-29.4622993469,27.552499771099999]
["Windhoek","Hosea Kutako International Airport","NA",-22.4799003601,17.470899581899999]
["Kinshasa","Ndjili International Airport","CD",-4.3857498168999998,15.444600105299999]
["Kisangani","Bangoka International Airport","CD",0.48163899780000002,25.337999343900002]
["Goma","Goma International Airport","CD",-1.6708099841999999,29.2385005951]
["Lubumbashi","Lubumbashi International Airport","CD",-11.591300010699999,27.5308990479]
["Banjul","Banjul International Airport","GM",13.338000297500001,-16.6522006989]
["Bonthe","Sherbro International Airport","SL",7.5324201583999999,-12.518899917600001]
["Freetown","Lungi International Airport","SL",8.6164398193,-13.1955003738]
["Bissau","Osvaldo Vieira International Airport","GW",11.894800186199999,-15.653699874899999]
["Monrovia","Roberts International Airport","LR",6.2337899207999996,-10.3622999191]
["Casablanca","Mohammed V International Airport","MA",33.367500305199997,-7.5899701117999996]
["Nador","Nador International Airport","MA",34.988800048800002,-3.0282099247000001]
["Diass","Blaise Diagne International Airport","SN",14.671111,-17.066943999999999]
["Dakar","Leopold Sedar Senghor International Airport","SN",14.739700317400001,-17.4902000427]
["Nouakchott","Nouakchott International Airport","MR",18.0981998444,-15.948499679599999]
["Atar","Atar International Airport","MR",20.5067996979,-13.0431995392]
["Nouadhibou","Nouadhibou International Airport","MR",20.933099746700002,-17.030000686600001]
["Espargos","Amilcar Cabral International Airport","CV",16.741399765000001,-22.949399948100002]
["Praia","Praia International Airport","CV",14.9245004654,-23.4934997559]
["Addis Ababa","Bole International Airport","ET",8.9778900146999998,38.799301147500003]
["Dire Dawa","Aba Tenna Dejazmach Yilma International Airport","ET",9.6246995926000007,41.854198455800002]
["Bujumbura","Bujumbura International Airport","BI",-3.3240199089,29.318500518800001]
["Hargeisa","Egal International Airport","SO",9.5181703568000007,44.088798522899999]
["Mogadishu","Aden Adde International Airport","SO",2.0144400597000001,45.304698944099997]
["El Alamein","El Alamein International Airport","EG",30.924499511699999,28.461399078399999]
["El Arish","El Arish International Airport","EG",31.073299408,33.835800170900001]
["Assiut","Assiut International Airport","EG",27.046499252299999,31.0119991302]
["Alexandria","Borg El Arab International Airport","EG",30.917699813799999,29.696399688700001]
["Cairo","Cairo International Airport","EG",30.121900558499998,31.4055995941]
["New Administrative Capital","Cairo Capital International Airport","EG",30.075832999999999,31.833333]
["Hurghada","Hurghada International Airport","EG",27.178300857499998,33.799400329599997]
["London","London Heathrow Airport","GB",51.470600128199997,-0.46194100380000003]
["Luxor","Luxor International Airport","EG",25.670999526999999,32.706600189200003]
["Marsa Alam","Marsa Alam International Airport","EG",25.557100296000002,34.583698272699998]
["Sohag","Sohag International Airport","EG",26.342777777799999,31.742777777800001]
["Skopje","Skopje Alexander the Great Airport","MK",41.961601257300003,21.621400833100001]
["Sharm el-Sheikh","Sharm El Sheikh International Airport","EG",27.977300643900001,34.395000457800002]
["Aswan","Aswan International Airport","EG",23.9643993378,32.819999694800003]
["Giza","Sphinx International Airport","EG",30.114722199999999,30.893333299999998]
["Taba","Taba International Airport","EG",29.587799072300001,34.778099060099997]
["Asmara","Asmara International Airport","ER",15.2918996811,38.910701751700003]
["Massawa","Massawa International Airport","ER",15.670000076299999,39.370098114000001]
["Asab","Assab International Airport","ER",13.071800231899999,42.645000457800002]
["Eldoret","Eldoret International Airport","KE",0.40445798640000002,35.238899230999998]
["Nairobi","Jomo Kenyatta International Airport","KE",-1.319239974,36.927799224899999]
["Mombasa","Mombasa Moi International Airport","KE",-4.0348300934000001,39.594200134300003]
["Benghazi","Benina International Airport","LY",32.096801757800002,20.269500732400001]
["Tripoli","Tripoli International Airport","LY",32.663501739499999,13.1590003967]
["Kigali","Kigali International Airport","RW",-1.9686299563,30.139499664300001]
["Port Sudan","Port Sudan New International Airport","SD",19.433599472000001,37.234100341800001]
["Khartoum","Khartoum International Airport","SD",15.589500427200001,32.553199768100001]
["Dar es Salaam","Mwalimu Julius K. Nyerere International Airport","TZ",-6.8781099319000001,39.202598571800003]
["Arusha","Kilimanjaro International Airport","TZ",-3.4294099808,37.074501037600001]
["Kampala","Entebbe International Airport","UG",4.2385999100000002E-2,32.443500518800001]
["Allentown","Lehigh Valley International Airport","US",40.652099609399997,-75.4408035278]
["Albuquerque","Albuquerque International Sunport Airport","US",35.040199279799999,-106.6090011597]
["Atlantic City","Atlantic City International Airport","US",39.457599639900003,-74.577201843300003]
["Alexandria","Alexandria International Airport","US",31.327400207499998,-92.549797058099998]
["Akron","Akron Fulton International Airport","US",41.037498474099998,-81.466903686500004]
["Albany","Albany International Airport","US",42.748298644999998,-73.801696777299995]
["Alice","Alice International Airport","US",27.740900039700001,-98.026901245100007]
["Amarillo","Rick Husband Amarillo International Airport","US",35.219398498499999,-101.7060012817]
["Watertown","Watertown International Airport","US",43.991901397699998,-76.021697997999993]
["Atlanta","Hartsfield Jackson Atlanta International Airport","US",33.636699676500001,-84.428100585899998]
["Appleton","Appleton International Airport","US",44.258098602300002,-88.519096374499995]
["Austin","Austin Bergstrom International Airport","US",30.194499969500001,-97.669898986800007]
["Wilkes-Barre/Scranton","Wilkes Barre Scranton International Airport","US",41.338500976600002,-75.723396301299999]
["Kalamazoo","Kalamazoo Battle Creek International Airport","US",42.234901428199997,-85.552101135300006]
["Baudette","Baudette International Airport","US",48.728401184100001,-94.612197875999996]
["Hartford","Bradley International Airport","US",41.938899993900002,-72.683197021500007]
["Seattle","Boeing Field King County International Airport","US",47.529998779300001,-122.3020019531]
["Bangor","Bangor International Airport","US",44.807399749799998,-68.828102111800007]
["Birmingham","Birmingham-Shuttlesworth International Airport","US",33.562900540000001,-86.753501889999995]
["Billings","Billings Logan International Airport","US",45.807701110799997,-108.5429992676]
["Bellingham","Bellingham International Airport","US",48.792800903299998,-122.5380020142]
["Nashville","Nashville International Airport","US",36.124500274699997,-86.678199768100001]
["Boston","General Edward Lawrence Logan International Airport","US",42.364299770000002,-71.005203249999994]
["Brownsville","Brownsville South Padre Island International Airport","US",25.906799316400001,-97.425903320299994]
["Burlington","Patrick Leahy Burlington International Airport","US",44.471900939900003,-73.153297424300007]
["Buffalo","Buffalo Niagara International Airport","US",42.940498349999999,-78.73220062]
["Baltimore","Baltimore/Washington International Thurgood Marshal Airport","US",39.175399779999999,-76.668296810000001]
["Blytheville","Arkansas International Airport","US",35.964298248299997,-89.944000244099996]
["Bozeman","Bozeman Yellowstone International Airport","US",45.777500150000002,-111.1529999]
["Carmelo","Carmelo International Airport","UY",-33.966110229500003,-58.325279235799997]
["Charleston","Charleston Air Force Base-International Airport","US",32.898601530000001,-80.040496829999995]
["Sault Ste Marie","Chippewa County International Airport","US",46.250801086400003,-84.472396850600006]
["Cleveland","Cleveland Hopkins International Airport","US",41.411701202400003,-81.849800109900002]
["Port Angeles","William R Fairchild International Airport","US",48.120201110799997,-123.5]
["Charlotte","Charlotte Douglas International Airport","US",35.214000701899998,-80.943099975600006]
["Columbus","John Glenn Columbus International Airport","US",39.9980010986,-82.891899108900006]
["Casper","Casper-Natrona County International Airport","US",42.908000950000002,-106.4639969]
["Corpus Christi","Corpus Christi International Airport","US",27.770399093599998,-97.501197814899996]
["Hebron","Cincinnati Northern Kentucky International Airport","US",39.048801422099999,-84.667800903300005]
["Lake Charles","Chennault International Airport","US",30.2105998993,-93.143203735399993]
["Calexico","Calexico International Airport","US",32.669498443599998,-115.51300048829999]
["Daytona Beach","Daytona Beach International Airport","US",29.179899215700001,-81.058097839400006]
["Dayton","James M Cox Dayton International Airport","US",39.902400970499997,-84.219398498499999]
["Denver","Denver International Airport","US",39.861698150599999,-104.672996521]
["Dallas-Fort Worth","Dallas Fort Worth International Airport","US",32.896800994899998,-97.038002014200003]
["Duluth","Duluth International Airport","US",46.8420982361,-92.193603515600003]
["Del Rio","Del Rio International Airport","US",29.374200820900001,-100.927001953]
["Des Moines","Des Moines International Airport","US",41.534000396700002,-93.663101196300005]
["Douglas Bisbee","Bisbee Douglas International Airport","US",31.468999862699999,-109.60399627699999]
["Panama City Beach","Northwest Florida Beaches International Airport","US",30.341699999999999,-85.797300000000007]
["Newport","Northeast Kingdom International Airport","US",44.888801574699997,-72.229202270499997]
["El Paso","El Paso International Airport","US",31.807199480000001,-106.3779984]
["Erie","Erie International Tom Ridge Field","US",42.083127013400002,-80.173866748799995]
["Newark","Newark Liberty International Airport","US",40.6925010681,-74.168701171899997]
["Key West","Key West International Airport","US",24.556100845300001,-81.759597778300005]
["Fargo","Hector International Airport","US",46.920700073200003,-96.8158035278]
["Fresno","Fresno Yosemite International Airport","US",36.776199340799998,-119.7180023193]
["Fort Lauderdale","Fort Lauderdale Hollywood International Airport","US",26.072599410999999,-80.152702331499995]
["Flint","Bishop International Airport","US",42.9654006958,-83.743598938000005]
["Fort Pierce","Treasure Coast International Airport","US",27.495100019999999,-80.368301389999999]
["Fort Worth","Fort Worth Meacham International Airport","US",32.819801330600001,-97.362396240199999]
["Fort Wayne","Fort Wayne International Airport","US",40.978500369999999,-85.195098880000003]
["Spokane","Spokane International Airport","US",47.619899749799998,-117.533996582]
["Grand Forks","Grand Forks International Airport","US",47.949298858600002,-97.176101684599999]
["Glasgow","Wokal Field Glasgow International Airport","US",48.212501525900002,-106.6149978638]
["Galveston","Scholes International At Galveston Airport","US",29.2653007507,-94.8603973389]
["Kalispell","Glacier Park International Airport","US",48.3105010986,-114.2559967041]
["Gulfport","Gulfport Biloxi International Airport","US",30.407300949100001,-89.070098877000007]
["Green Bay","Austin Straubel International Airport","US",44.485099792500002,-88.129600524899999]
["Grand Rapids","Gerald R. Ford International Airport","US",42.880798339999998,-85.522796630000002]
["Greensboro","Piedmont Triad International Airport","US",36.097801208500002,-79.937301635699995]
["Greenville","Greenville Spartanburg International Airport","US",34.895698547400002,-82.218902587900004]
["Great Falls","Great Falls International Airport","US",47.481998439999998,-111.37100220000001]
["Gary","Gary Chicago International Airport","US",41.616298675499998,-87.412803649899999]
["Harlingen","Valley International Airport","US",26.228500366199999,-97.654403686500004]
["Huntsville","Huntsville International Carl T Jones Field","US",34.637199401899998,-86.775100707999997]
["Terre Haute","Terre Haute International Hulman Field","US",39.451499939000001,-87.307601928699995]
["Houlton","Houlton International Airport","US",46.123100280800003,-67.792098999000004]
["Dulles","Washington Dulles International Airport","US",38.944499970000003,-77.455802919999996]
["Niagara Falls","Niagara Falls International Airport","US",43.107299804699998,-78.946197509800001]
["Bullhead City","Laughlin Bullhead International Airport","US",35.157398219999997,-114.5599976]
["Wilmington","Wilmington International Airport","US",34.270599365199999,-77.902603149399994]
["Indianapolis","Indianapolis International Airport","US",39.717300414999997,-86.294403076199998]
["International Falls","Falls International Airport","US",48.5662002563,-93.403099060100004]
["Williston","Sloulin Field International Airport","US",48.177898407000001,-103.64199829099999]
["Jackson","Jackson Evers International Airport","US",32.3111991882,-90.075897216800001]
["Jacksonville","Jacksonville International Airport","US",30.494100570699999,-81.687896728499993]
["New York","John F Kennedy International Airport","US",40.639801030000001,-73.778900149999998]
["Lansing","Capital Region International Airport","US",42.778701782200002,-84.587402343799994]
["Las Vegas","Harry Reid International Airport","US",36.08010101,-115.15200040000001]
["Los Angeles","Los Angeles International Airport","US",33.942501069999999,-118.4079971]
["Lubbock","Lubbock Preston Smith International Airport","US",33.663600921600001,-101.8229980469]
["Columbus","Rickenbacker International Airport","US",39.8138008118,-82.927803039599993]
["Leesburg","Leesburg International Airport","US",28.82309914,-81.808700560000005]
["Laredo","Laredo International Airport","US",27.543800353999998,-99.461601257300003]
["Las Cruces","Las Cruces International Airport","US",32.289398193399997,-106.92199707029999]
["Lawrenceville","Lawrenceville Vincennes International Airport","US",38.7643013,-87.605499267599996]
["Midland","Midland International Air and Space Port Airport","US",31.942499160800001,-102.202003479]
["Saginaw","MBS International Airport","US",43.5329017639,-84.079597473099994]
["Kansas City","Kansas City International Airport","US",39.297599792500002,-94.713897705099996]
["Orlando","Orlando International Airport","US",28.429399490400002,-81.308998107899995]
["Harrisburg","Harrisburg International Airport","US",40.193500518800001,-76.763397216800001]
["Chicago","Chicago Midway International Airport","US",41.785999298100002,-87.752403259299996]
["Memphis","Memphis International Airport","US",35.042400360099997,-89.976699829099999]
["Mercedes","Ricardo de Tomasi International Airport","UY",-33.25,-58.067001342799998]
["Mc Allen","Mc Allen Miller International Airport","US",26.17580032,-98.238601680000002]
["Medford","Rogue Valley International Medford Airport","US",42.374198913599997,-122.8730010986]
["Miami","Miami International Airport","US",25.7931995392,-80.290603637700002]
["Milwaukee","General Mitchell International Airport","US",42.947200775100001,-87.896598815900006]
["Melbourne","Melbourne Orlando International Airport","US",28.102800369299999,-80.645301818799993]
["Moline","Quad City International Airport","US",41.448501586900001,-90.507499694800003]
["Minot","Minot International Airport","US",48.259399414100002,-101.2799987793]
["Missoula","Missoula International Airport","US",46.916301730000001,-114.09100340000001]
["Minneapolis","Minneapolis-St Paul International/Wold-Chamberlain Airport","US",44.881999969500001,-93.221801757799994]
["Massena","Massena International Richards Field","US",44.935798644999998,-74.845596313499996]
["Monticello","Sullivan County International Airport","US",41.701599119999997,-74.79499817]
["New Orleans","Louis Armstrong New Orleans International Airport","US",29.993400573700001,-90.258003234900002]
["Moses Lake","Grant Co International Airport","US",47.207698819999997,-119.3199997]
["Myrtle Beach","Myrtle Beach International Airport","US",33.679698944099997,-78.928298950200002]
["Yuma","Yuma MCAS/Yuma International Airport","US",32.656600949999998,-114.6060028]
["Oakland","Metropolitan Oakland International Airport","US",37.721298217799998,-122.22100067140001]
["Ocala","Ocala International Jim Taylor Field","US",29.17259979,-82.22419739]
["Ogdensburg","Ogdensburg International Airport","US",44.681900024400001,-75.465499877900001]
["Nogales","Nogales International Airport","US",31.417699813799999,-110.84799957280001]
["Ontario","Ontario International Airport","US",34.055999755899997,-117.6009979248]
["Chicago","Chicago O'Hare International Airport","US",41.978599549999998,-87.904800420000001]
["Norfolk","Norfolk International Airport","US",36.894599914600001,-76.201202392599996]
["Plattsburgh","Plattsburgh International Airport","US",44.650901794399999,-73.468101501500001]
["West Palm Beach","Palm Beach International Airport","US",26.683200836200001,-80.095596313499996]
["Portland","Portland International Airport","US",45.588699339999998,-122.59799959999999]
["Panama City","Panama City-Bay Co International Airport","US",30.212099075299999,-85.682800293]
["Newport News","Newport News Williamsburg International Airport","US",37.131900790000003,-76.492996219999995]
["Philadelphia","Philadelphia International Airport","US",39.871898651099997,-75.241096496599994]
["Port Huron","St Clair County International Airport","US",42.9109993,-82.528900149999998]
["Phoenix","Phoenix Sky Harbor International Airport","US",33.434299469000003,-112.0120010376]
["St Petersburg-Clearwater","St Petersburg Clearwater International Airport","US",27.910200119999999,-82.687400819999993]
["Pittsburgh","Pittsburgh International Airport","US",40.491500850000001,-80.232902530000004]
["Presque Isle","Presque Isle International Airport","US",46.688999180000003,-68.044799800000007]
["Pascagoula","Trent Lott International Airport","US",30.462799072300001,-88.529197692899999]
["Portsmouth","Portsmouth International at Pease Airport","US",43.077899932900003,-70.823303222700005]
["Palm Springs","Palm Springs International Airport","US",33.829700469999999,-116.50700378419999]
["Pontiac","Oakland County International Airport","US",42.665500640899999,-83.420097351099997]
["Providence","Rhode Island TF Green International Airport","US",41.732601165799998,-71.420402526900006]
["Portland","Portland International Jetport Airport","US",43.646198269999999,-70.309303279999995]
["Raleigh/Durham","Raleigh Durham International Airport","US",35.877601623499999,-78.787498474100005]
["Chicago/Rockford","Chicago Rockford International Airport","US",42.195400237999998,-89.097198486300002]
["Richmond","Richmond International Airport","US",37.505199432399998,-77.319702148399998]
["Rome","Griffiss International Airport","US",43.233798980000003,-75.406997680000003]
["Reno","Reno Tahoe International Airport","US",39.499099731400001,-119.7679977417]
["Rochester","Greater Rochester International Airport","US",43.118900299099998,-77.672401428200004]
["Roswell","Roswell International Air Center Airport","US",33.301601409900002,-104.53099822999999]
["Warroad","Warroad International Memorial Field","US",48.941398620000001,-95.348396300000005]
["Rochester","Rochester International Airport","US",43.9082984924,-92.5]
["Fort Myers","Southwest Florida International Airport","US",26.536199569699999,-81.755203247099999]
["San Diego","San Diego International Airport","US",32.733600616499999,-117.1900024414]
["San Antonio","San Antonio International Airport","US",29.533700942999999,-98.469802856399994]
["Savannah","Savannah Hilton Head International Airport","US",32.12760162,-81.202102659999994]
["Marquette","Sawyer International Airport","US",46.353599548299997,-87.395401000999996]
["San Bernardino","San Bernardino International Airport","US",34.0954017639,-117.23500061039999]
["Louisville","Louisville Muhammad Ali International Airport","US",38.174400329599997,-85.736000060999999]
["Seattle","Seattle Tacoma International Airport","US",47.449001312299998,-122.3089981079]
["Orlando","Orlando Sanford International Airport","US",28.7775993347,-81.237503051800005]
["San Francisco","San Francisco International Airport","US",37.618999481199999,-122.375]
["San Jose","Norman Y. Mineta San Jose International Airport","US",37.362598419199998,-121.9290008545]
["Salt Lake City","Salt Lake City International Airport","US",40.788398742699997,-111.9779968262]
["Sacramento","Sacramento International Airport","US",38.695400237999998,-121.591003418]
["Sarasota/Bradenton","Sarasota Bradenton International Airport","US",27.395399093599998,-82.554397582999997]
["St Louis","Lambert St Louis International Airport","US",38.7486991882,-90.370002746599994]
["Newburgh","Stewart International Airport","US",41.504100799600003,-74.104797363299994]
["Syracuse","Syracuse Hancock International Airport","US",43.111198425300003,-76.106300353999998]
["Tampa","Tampa International Airport","US",27.975500106799998,-82.533203125]
["Tulsa","Tulsa International Airport","US",36.198398590099998,-95.888099670399995]
["Tucson","Tucson International Airport","US",32.116100311300002,-110.9410018921]
["Williston","Williston Basin International Airport","US",48.259721999999996,-103.750556]
["Tirana","Tirana International Airport Mother Teresa","AL",41.414699554400002,19.720600128200001]
["Plovdiv","Plovdiv International Airport","BG",42.067798614499999,24.8507995605]
["Nicosia","Ercan International Airport","CY",35.154701232900003,33.496101379400002]
["Larnarca","Larnaca International Airport","CY",34.875099182100001,33.624900817899999]
["Paphos","Paphos International Airport","CY",34.717998504599997,32.4856987]
["Alicante","Alicante International Airport","ES",38.282199859599999,-0.55815601349999999]
["Almeria","Almeria International Airport","ES",36.843898773200003,-2.3701000213999999]
["Barcelona","Barcelona International Airport","ES",41.297100067099997,2.0784599781000002]
["Madrid","Madrid Barajas International Airport","ES",40.493600000000001,-3.5667599999999999]
["Corvera","Región de Murcia International Airport","ES",37.802999999999997,-1.125]
["Paris","Charles de Gaulle International Airport","FR",49.012798309300003,2.5499999522999999]
["Athens","Eleftherios Venizelos International Airport","GR",37.936401367199998,23.944499969500001]
["Heraklion","Heraklion International Nikos Kazantzakis Airport","GR",35.339698791499998,25.180299758899999]
["Kerkyra Island","Ioannis Kapodistrias International Airport","GR",39.601898193399997,19.911699294999998]
["Kavala","Alexander the Great International Airport","GR",40.9132995605,24.6191997528]
["Mytilene","Mytilene International Airport","GR",39.056701660199998,26.598300933800001]
["Souda","Chania International Airport","GR",35.531700134300003,24.149700164799999]
["Thessaloniki","Thessaloniki Macedonia International Airport","GR",40.519699096700002,22.970899581899999]
["Budapest","Budapest Ferenc Liszt International Airport","HU",47.436901092500001,19.255599975599999]
["Debrecen","Debrecen International Airport","HU",47.488899230999998,21.615299224899999]
["Gyor","Gyor-Per International Airport","HU",47.624401092500001,17.8136005402]
["Sarmellek","Sarmellek International Airport","HU",46.686401367199998,17.159099578900001]
["Bari","Bari / Palese International Airport","IT",41.138900756799998,16.7605991364]
["Pescara","Pescara International Airport","IT",42.431701660199998,14.181099891700001]
["Milan","Malpensa International Airport","IT",45.630599975599999,8.7281103134000002]
["Torino","Torino / Caselle International Airport","IT",45.200801849400001,7.6496300696999997]
["Albenga","Villanova D'Albenga International Airport","IT",44.0505981445,8.1274299622000008]
["Rimini","Rimini / Miramare - Federico Fellini International Airport","IT",44.0203018188,12.611700058]
["Rome","Leonardo Da Vinci (Fiumicino) International Airport","IT",41.804500579799999,12.2508001328]
["Napoli","Napoli / Capodichino International Airport","IT",40.886001586900001,14.2908000946]
["Pisa","Pisa / San Giusto - Galileo Galilei International Airport","IT",43.683898925800001,10.3927001953]
["Karlovy Vary","Karlovy Vary International Airport","CZ",50.202999114999997,12.9149999619]
["Tel Aviv","Ben Gurion International Airport","IL",32.011398315400001,34.886699676500001]
["Haifa","Haifa International Airport","IL",32.809398651099997,35.043098449699997]
["Eilat","Ovda International Airport","IL",29.9402999878,34.935798644999998]
["Vienna","Vienna International Airport","AT",48.110298156699997,16.569700241100001]
["Beja","Beja International Airport","PT",38.078899383500001,-7.9324002266000004]
["Banja Luka","Banja Luka International Airport","BA",44.941398620599998,17.2975006104]
["Mostar","Mostar International Airport","BA",43.2829017639,17.845899581899999]
["Sarajevo","Sarajevo International Airport","BA",43.824600219700002,18.3314990997]
["Tuzla","Tuzla International Airport","BA",44.458698272699998,18.724800109899999]
["Arad","Arad International Airport","RO",46.176601409900002,21.2619991302]
["Bucharest","Baneasa International Airport","RO",44.503200530999997,26.102100372300001]
["Constanta","Mihail Kogalniceanu International Airport","RO",44.362201690699997,28.488300323499999]
["Cluj-Napoca","Cluj-Napoca International Airport","RO",46.785198211699999,23.6861991882]
["Oradea","Oradea International Airport","RO",47.025299072300001,21.902500152599998]
["Bucharest","Henri Coanda International Airport","RO",44.572200775100001,26.102199554399999]
["Sibiu","Sibiu International Airport","RO",45.785598754900001,24.091299057000001]
["Targu Mures","Transilvania Targu Mures International Airport","RO",46.4677009583,24.412500381499999]
["Geneva","Geneva Cointrin International Airport","CH",46.2380981445,6.1089501381]
["Ankara","Esenboga International Airport","TR",40.128101348900003,32.995098114000001]
["Antalya","Antalya International Airport","TR",36.898700714100002,30.8005008698]
["Gaziantep","Gaziantep International Airport","TR",36.947200775100001,37.4786987305]
["Nevsehir","Nevsehir Kapadokya International Airport","TR",38.771900176999999,34.534500122099999]
["Istanbul","Ataturk International Airport","TR",40.976898193399997,28.814599990800001]
["Yarom","Yala Betong International Airport","TH",5.7862881000000002,101.1475228]
["Izmir","Adnan Menderes International Airport","TR",38.292400360099997,27.156999588000001]
["Dalaman","Dalaman International Airport","TR",36.713100433299999,28.792499542200002]
["Erzurum","Erzurum International Airport","TR",39.956501007100002,41.1702003479]
["Trabzon","Trabzon International Airport","TR",40.995098114000001,39.789699554400002]
["Isparta","Suleyman Demirel International Airport","TR",37.855400085399999,30.368400573700001]
["Bodrum","Milas Bodrum International Airport","TR",37.250598907499999,27.664300918599999]
["Istanbul","Sabiha Gokcen International Airport","TR",40.898601532000001,29.309200286900001]
["Strymba","Balti International Airport","MD",47.838100433299999,27.781499862699999]
["Chisinau","Chisinau International Airport","MD",46.927700042700003,28.9309997559]
["Cockburn Town","JAGS McCartney International Airport","TC",21.444499969500001,-71.142303466800001]
["Barahona","Maria Montez International Airport","DO",18.251499175999999,-71.120399475100001]
["Samana","Samana El Catey International Airport","DO",19.267000198400002,-69.741996765099998]
["La Isabela","La Isabela International Airport","DO",18.572500228900001,-69.985603332500006]
["La Romana","Casa De Campo International Airport","DO",18.450700759899998,-68.911796569800003]
["Punta Cana","Punta Cana International Airport","DO",18.567399978600001,-68.363403320299994]
["Puerto Plata","Gregorio Luperon International Airport","DO",19.757900238000001,-70.569999694800003]
["Santo Domingo","Las Americas International Airport","DO",18.4297008514,-69.6688995361]
["Santiago","Cibao International Airport","DO",19.406099319500001,-70.604698181200007]
["San Benito","Mundo Maya International Airport","GT",16.913799285900001,-89.866401672400002]
["La Ceiba","Goloson International Airport","HN",15.7425003052,-86.852996826199998]
["La Mesa","Ramon Villeda Morales International Airport","HN",15.4525995255,-87.923599243200002]
["Roatan Island","Juan Manuel Galvez International Airport","HN",16.316799163799999,-86.523002624499995]
["Tegucigalpa","Toncontin International Airport","HN",14.0608997345,-87.217201232899995]
["Kingston","Norman Manley International Airport","JM",17.935699462900001,-76.787498474100005]
["Montego Bay","Sangster International Airport","JM",18.5037002563,-77.913398742699997]
["Acapulco","General Juan N Alvarez International Airport","MX",16.757099151599999,-99.753997802699999]
["Aguascalientes","Jesus Teran International Airport","MX",21.705600738499999,-102.318000793]
["Huatulco","Bahias de Huatulco International Airport","MX",15.7753000259,-96.262603759800001]
["Ciudad Acuna","Ciudad Acuna New International Airport","MX",29.332899093599998,-101.0989990234]
["Ciudad del Carmen","Ciudad del Carmen International Airport","MX",18.653699874899999,-91.799003601099997]
["Culiacan","Federal de Bachigualato International Airport","MX",24.764499664300001,-107.474998474]
["Chetumal","Chetumal International Airport","MX",18.504699707,-88.326797485399993]
["Ciudad Obregon","Ciudad Obregon International Airport","MX",27.392599105799999,-109.8330001831]
["Campeche","Ingeniero Alberto Acuna Ongay International Airport","MX",19.816799163799999,-90.500297546400006]
["Ciudad Juarez","Abraham Gonzalez International Airport","MX",31.636100768999999,-106.4290008545]
["Chihuahua","General Roberto Fierro Villalobos International Airport","MX",28.702899932899999,-105.96499633800001]
["Ciudad Victoria","General Pedro Jose Mendez International Airport","MX",23.703300476100001,-98.956497192399993]
["Cozumel","Cozumel International Airport","MX",20.522399902299998,-86.9255981445]
["Durango","General Guadalupe Victoria International Airport","MX",24.124200820900001,-104.527999878]
["Guadalajara","Don Miguel Hidalgo Y Costilla International Airport","MX",20.5217990875,-103.3109970093]
["Guaymas","General Jose Maria Yanez International Airport","MX",27.968999862699999,-110.9250030518]
["Hermosillo","General Ignacio P. Garcia International Airport","MX",29.095899581899999,-111.047996521]
["Saltillo","Plan De Guadalupe International Airport","MX",25.549499511699999,-100.9290008545]
["Los Mochis","Valle del Fuerte International Airport","MX",25.6851997375,-109.081001282]
["Silao","Del Bajio International Airport","MX",20.9934997559,-101.481002808]
["La Paz","Manuel Marquez de Leon International Airport","MX",24.072700500500002,-110.361999512]
["Loreto","Loreto International Airport","MX",25.989200592,-111.34799957280001]
["Matamoros","General Servando Canales International Airport","MX",25.769899368299999,-97.525299072300001]
["Mexicali","General Rodolfo Sanchez Taboada International Airport","MX",32.630599975599999,-115.241996765]
["Morelia","General Francisco J. Mujica International Airport","MX",19.849899292,-101.025001526]
["Mexico City","Licenciado Benito Juarez International Airport","MX",19.436300277699999,-99.072097778300005]
["Monterrey","General Mariano Escobedo International Airport","MX",25.778499603299998,-100.10700225799999]
["Mazatlan","General Rafael Buelna International Airport","MX",23.1613998413,-106.26599883999999]
["Nuevo Laredo","Quetzalcoatl International Airport","MX",27.443899154699999,-99.570503234900002]
["Oaxaca","Xoxocotlan International Airport","MX",16.999900817899999,-96.726600646999998]
["Puebla","Hermanos Serdan International Airport","MX",19.158100128200001,-98.371398925799994]
["Puerto Penasco","Puerto Penasco International Airport","MX",31.356202302,-113.525676727]
["Puerto Vallarta","Licenciado Gustavo Diaz Ordaz International Airport","MX",20.680099487300001,-105.2539978027]
["Puerto Escondido","Puerto Escondido International Airport","MX",15.876899719200001,-97.089103698700001]
["Reynosa","General Lucio Blanco International Airport","MX",26.008899688700001,-98.228500366199995]
["San Jose del Cabo","Los Cabos International Airport","MX",23.1518001556,-109.72100067140001]
["Cabo San Lucas","Cabo San Lucas International Airport","MX",22.947700500500002,-109.93699646]
["Santa Lucia","Felipe Angeles International Airport","MX",19.756667,-99.015277999999995]
["San Luis Potosi","Ponciano Arriaga International Airport","MX",22.254299163799999,-100.93099975600001]
["Torreon","Francisco Sarabia International Airport","MX",25.5683002472,-103.41100311300001]
["Tuxtla Gutierrez","Angel Albino Corzo International Airport","MX",16.5636005402,-93.022499084499998]
["Tijuana","General Abelardo L. Rodriguez International Airport","MX",32.541099548299997,-116.9700012207]
["Tulum","Felipe Carrillo Puerto International Airport","MX",20.166667,-87.666667000000004]
["Tampico","General Francisco Javier Mina International Airport","MX",22.296400070200001,-97.865898132300003]
["Toluca","Licenciado Adolfo Lopez Mateos International Airport","MX",19.337099075299999,-99.566001892100005]
["Tapachula","Tapachula International Airport","MX",14.794300079299999,-92.370002746599994]
["Cancun","Cancun International Airport","MX",21.036500930799999,-86.877098083500002]
["Villahermosa","Carlos Rovirosa Perez International Airport","MX",17.9969997406,-92.817398071300005]
["Veracruz","General Heriberto Jara International Airport","MX",19.145900726299999,-96.187301635699995]
["Zacatecas","General Leobardo C. Ruiz International Airport","MX",22.8971004486,-102.68699646]
["Ixtapa","Ixtapa Zihuatanejo International Airport","MX",17.601600647000001,-101.460998535]
["Manzanillo","Playa De Oro International Airport","MX",19.144800186200001,-104.558998108]
["Managua","Augusto C. Sandino (Managua) International Airport","NI",12.141500473000001,-86.168197631799998]
["Isla Colon","Bocas Del Toro International Airport","PA",9.3408498764000001,-82.250801086400003]
["Changuinola","Cap Manuel Nino International Airport","PA",9.4586400986000001,-82.516799926800005]
["David","Enrique Malek International Airport","PA",8.3909997940000007,-82.434997558600003]
["Panama City","Howard/Panama Pacifico International Airport","PA",8.9147901535000003,-79.599601745599998]
["Albrook","Marcos A. Gelabert International Airport","PA",8.9733400344999996,-79.555603027299995]
["Rio Hato","Scarlett Martinez International Airport","PA",8.3758330000000001,-80.127778000000006]
["Tocumen","Tocumen International Airport","PA",9.0713596344000003,-79.383499145499997]
["Liberia","Daniel Oduber Quiros International Airport","CR",10.593299865700001,-85.544403076199998]
["Puerto Limon","Limon International Airport","CR",9.9579601287999999,-83.022003173800002]
["San Jose","Juan Santamaria International Airport","CR",9.9938602448000005,-84.2088012695]
["San Jose","Tobias Bolanos International Airport","CR",9.9570503235000007,-84.139801025400004]
["Santa Clara","El Salvador International Airport","SV",13.440899848899999,-89.055702209499998]
["San Salvador","Ilopango International Airport","SV",13.6995000839,-89.119903564500007]
["Cap Haitien","Cap Haitien International Airport","HT",19.732999801599998,-72.194702148399998]
["Port-au-Prince","Toussaint Louverture International Airport","HT",18.579999923700001,-72.292503356899999]
["Cayo Largo del Sur","Vilo Acuna International Airport","CU",21.6165008545,-81.545997619600001]
["Camaguey","Ignacio Agramonte International Airport","CU",21.420299530000001,-77.847503662099996]
["Santiago","Antonio Maceo International Airport","CU",19.969800949100001,-75.835403442399993]
["Havana","Jose Marti International Airport","CU",22.989200592,-82.409103393600006]
["Holguin","Frank Pais International Airport","CU",20.7856006622,-76.315101623499999]
["Varadero","Juan Gualberto Gomez International Airport","CU",23.034400939899999,-81.435302734399997]
["Cayman Brac","Gerrard Smith International Airport","KY",19.687000274700001,-79.882797241199995]
["Georgetown","Owen Roberts International Airport","KY",19.292800903300002,-81.357696533199999]
["Marsh Harbour","Marsh Harbour International Airport","BS",26.511400222799999,-77.083503723099994]
["George Town","Exuma International Airport","BS",23.562599182100001,-75.877998352099993]
["Freeport","Grand Bahama International Airport","BS",26.5587005615,-78.695602417000003]
["Nassau","Lynden Pindling International Airport","BS",25.038999557499999,-77.466201782200002]
["Belize City","Philip S. W. Goldson International Airport","BZ",17.539100647000001,-88.308197021500007]
["Avarua","Rarotonga International Airport","CK",-21.202699661299999,-159.80599975589999]
["Nadi","Nadi International Airport","FJ",-17.755399703999998,177.44299316409999]
["Nausori","Nausori International Airport","FJ",-18.043300628699999,178.5590057373]
["Nuku'alofa","Fua'amotu International Airport","TO",-21.2411994934,-175.14999389650001]
["Vava'u Island","Vava'u International Airport","TO",-18.585300445600001,-173.96200561520001]
["Funafuti","Funafuti International Airport","TV",-8.5250000000000004,179.195999]
["Tarawa","Bonriki International Airport","KI",1.3816399574,173.14700317379999]
["Alofi","Niue International Airport","NU",-19.0790309906,-169.92559814449999]
["Apia","Faleolo International Airport","WS",-13.829999923700001,-172.00799560550001]
["Pago Pago","Pago Pago International Airport","AS",-14.3310003281,-170.710006714]
["Papeete","Faa'a International Airport","PF",-17.5536994934,-149.60699462900001]
["Luganville","Santo Pekoa International Airport","VU",-15.5050001144,167.22000122099999]
["Noumea","La Tontouta International Airport","NC",-22.0146007538,166.21299743649999]
["Auckland","Auckland International Airport","NZ",-37.008098602300002,174.7920074463]
["Christchurch","Christchurch International Airport","NZ",-43.489398956300001,172.53199768069999]
["Hamilton","Hamilton International Airport","NZ",-37.866699218800001,175.33200073200001]
["Queenstown","Queenstown International Airport","NZ",-45.021099090600003,168.73899841299999]
["Wellington","Wellington International Airport","NZ",-41.327201843300003,174.80499267600001]
["Kabul","Kabul International Airport","AF",34.565898895300002,69.212303161600005]
["Manama","Bahrain International Airport","BH",26.2707996368,50.633598327599998]
["Al-'Ula","Prince Abdul Majeed bin Abdulaziz International Airport","SA",26.483332999999998,38.116943999999997]
["Ad Dammam","King Fahd International Airport","SA",26.471200942999999,49.797901153600002]
["Jeddah","King Abdulaziz International Airport","SA",21.679599761999999,39.156501769999998]
["Riyadh","King Khaled International Airport","SA",24.9575996399,46.6987991333]
["Hanak","Red Sea International Airport","SA",25.628067114969099,37.088822323268602]
["Kish Island","Kish International Airport","IR",26.526199340800002,53.980201721199997]
["Asalouyeh","Persian Gulf International Airport","IR",27.379600524899999,52.737701416]
["Isfahan","Esfahan Shahid Beheshti International Airport","IR",32.750801086400003,51.861301422099999]
["Tehran","Imam Khomeini International Airport","IR",35.416099548299997,51.152198791499998]
["Tehran","Mehrabad International Airport","IR",35.689201355000002,51.313400268599999]
["Bandar Abbas","Bandar Abbas International Airport","IR",27.218299865700001,56.377799987800003]
["Mashhad","Mashhad International Airport","IR",36.235198974600003,59.6409988403]
["Shiraz","Shiraz Shahid Dastghaib International Airport","IR",29.539199829099999,52.589801788300001]
["Tabriz","Tabriz International Airport","IR",38.133899688699998,46.2350006104]
["Zahedan","Zahedan International Airport","IR",29.475700378399999,60.906200408899998]
["Amman","Queen Alia International Airport","JO",31.722600936900001,35.993198394799997]
["Amman","Amman-Marka International Airport","JO",31.972700118999999,35.991600036599998]
["Aqaba","Aqaba King Hussein International Airport","JO",29.611600875899999,35.018100738500003]
["Kuwait City","Kuwait International Airport","KW",29.226600647000001,47.968898773200003]
["Beirut","Beirut Rafic Hariri International Airport","LB",33.820899963400002,35.4883995056]
["Abu Dhabi","Abu Dhabi International Airport","AE",24.4330005646,54.651100158699997]
["Al Ain","Al Ain International Airport","AE",24.261699676500001,55.609199523900003]
["Dubai","Dubai International Airport","AE",25.2527999878,55.364398956300001]
["Jebel Ali","Al Maktoum International Airport","AE",24.8966666667,55.161388888899999]
["Ras Al Khaimah","Ras Al Khaimah International Airport","AE",25.6135005951,55.9388008118]
["Sharjah","Sharjah International Airport","AE",25.328599929799999,55.517200469999999]
["Duqm","Duqm International Airport","OM",19.501899999999999,57.6342]
["Muscat","Muscat International Airport","OM",23.593299865700001,58.284400939900003]
["Faisalabad","Faisalabad International Airport","PK",31.364999771099999,72.994796752900001]
["Gwadar","Gwadar International Airport","PK",25.233299255399999,62.329498291]
["Islamabad","Benazir Bhutto International Airport","PK",33.616699218800001,73.099197387700002]
["Zagreb","Zagreb Airport","HR",45.742900848399998,16.068799972499999]
["Karachi","Jinnah International Airport","PK",24.906499862699999,67.160797119099996]
["Lahore","Alama Iqbal International Airport","PK",31.521600723300001,74.403602600100001]
["Multan","Multan International Airport","PK",30.203199386600001,71.419097900400004]
["Peshawar","Peshawar International Airport","PK",33.993900299099998,71.5146026611]
["Quetta","Quetta International Airport","PK",30.251399993900002,66.937797546400006]
["Turbat","Turbat International Airport","PK",25.9864006042,63.0302009583]
["Baghdad","Baghdad International Airport","IQ",33.262500762899997,44.234600067099997]
["Mosul","Mosul International Airport","IQ",36.305801391599999,43.147399902300002]
["Arbil","Erbil International Airport","IQ",36.237598419199998,43.963199615500002]
["Basrah","Basrah International Airport","IQ",30.549100875899999,47.662101745599998]
["Najaf","Al Najaf International Airport","IQ",31.989722,44.404167000000001]
["Sulaymaniyah","Sulaymaniyah International Airport","IQ",35.561748504599997,45.316738128700003]
["Aleppo","Aleppo International Airport","SY",36.180698394799997,37.224399566700001]
["Damascus","Damascus International Airport","SY",33.411499023399998,36.515598297099999]
["Latakia","Bassel Al-Assad International Airport","SY",35.401100158699997,35.948699951199998]
["Doha","Doha International Airport","QA",25.261100768999999,51.565101623499999]
["Doha","Hamad International Airport","QA",25.260594600000001,51.613766499999997]
["Aden","Aden International Airport","YE",12.8295001984,45.028800964399998]
["Hodeida","Hodeidah International Airport","YE",14.7530002594,42.976299285899998]
["Riyan","Mukalla International Airport","YE",14.662599563600001,49.375]
["Sana'a","Sana'a International Airport","YE",15.4763002396,44.219699859599999]
["Socotra Islands","Socotra International Airport","YE",12.630700111399999,53.905799865699997]
["Sayun","Sayun International Airport","YE",15.966099739100001,48.7882995605]
["Ta'izz","Ta'izz International Airport","YE",13.6859998703,44.139099121100003]
["Fairbanks","Fairbanks International Airport","US",64.815101619999993,-147.8560028]
["Juneau","Juneau International Airport","US",58.354999542199998,-134.57600402829999]
["Ketchikan","Ketchikan International Airport","US",55.355598450000002,-131.71400449999999]
["Anchorage","Ted Stevens Anchorage International Airport","US",61.174400329599997,-149.99600219729999]
["Rota Island","Rota International Airport","MP",14.174300193800001,145.24299621579999]
["Saipan Island","Francisco C. Ada Saipan International Airport","MP",15.1190004349,145.72900390629999]
["Hagatna","Antonio B. Won Pat International Airport","GU",13.4834003448,144.79600524899999]
["Tinian Island","Tinian International Airport","MP",14.9991998672,145.6190032959]
["Kailua/Kona","Kona International At Keahole Airport","US",19.738800048800002,-156.04600524899999]
["Honolulu","Honolulu International Airport","US",21.318700790400001,-157.92199707029999]
["Hilo","Hilo International Airport","US",19.7213993073,-155.0480041504]
["Majuro Atoll","Marshall Islands International Airport","MH",7.0647602081,171.27200317379999]
["Kaieteur Falls","Kaieteur International Airport","GY",5.1727547645999996,-59.491481780999997]
["Banana","Cassidy International Airport","KI",1.9861600398999999,-157.35000610349999]
["Weno Island","Chuuk International Airport","FM",7.4618701935000002,151.84300231930001]
["Pohnpei Island","Pohnpei International Airport","FM",6.9850997924999998,158.2089996338]
["Okat","Kosrae International Airport","FM",5.3569798469999999,162.95799255399999]
["Yap Island","Yap International Airport","FM",9.4989099502999998,138.0829925537]
["Kaohsiung City","Kaohsiung International Airport","TW",22.5771007538,120.3499984741]
["Taipei","Taiwan Taoyuan International Airport","TW",25.077699661299999,121.23300170900001]
["Tokyo","Narita International Airport","JP",35.764701843300003,140.38600158689999]
["Osaka","Kansai International Airport","JP",34.427299499500002,135.2440032959]
["Tokoname","Chubu Centrair International Airport","JP",34.8583984375,136.80499267580001]
["Osaka","Osaka International Airport","JP",34.785499572799999,135.43800354000001]
["Tokyo","Tokyo International Airport","JP",35.552299499500002,139.7799987793]
["Sokcho / Gangneung","Yangyang International Airport","KR",38.061298370400003,128.66900634769999]
["Jeju City","Jeju International Airport","KR",33.5112991333,126.49299621580001]
["Busan","Gimhae International Airport","KR",35.179500579799999,128.93800354000001]
["Seoul","Incheon International Airport","KR",37.4691009521,126.4509963989]
["Seoul","Gimpo International Airport","KR",37.558300018300002,126.79100036600001]
["Cheongju","Cheongju International Airport","KR",36.716598510700003,127.499000549]
["Olongapo City","Subic Bay International Airport","PH",14.7944002151,120.27100372309999]
["Angeles City","Diosdado Macapagal International Airport","PH",15.1859998703,120.559997559]
["Laoag City","Laoag International Airport","PH",18.178100585900001,120.5319976807]
["Daraga","Legazpi Bicol International Airport","PH",13.1122222,123.6772222]
["Manila","Ninoy Aquino International Airport","PH",14.508600234999999,121.019996643]
["Legazpi City","Legazpi City International Airport","PH",13.157500000000001,123.735]
["Davao City","Francisco Bangoy International Airport","PH",7.1255202293000002,125.64600372309999]
["Zamboanga City","Zamboanga International Airport","PH",6.9224200249000001,122.0599975586]
["Bacolod City","Bacolod-Silay City International Airport","PH",10.776399612400001,123.01499938960001]
["Iloilo City","Iloilo International Airport","PH",10.833017,122.493358]
["Kalibo","Kalibo International Airport","PH",11.679400444000001,122.375999451]
["Lapu-Lapu City","Mactan Cebu International Airport","PH",10.3074998856,123.97899627690001]
["Ezeiza","Ministro Pistarini International Airport","AR",-34.822200000000002,-58.535800000000002]
["Merlo","Valle Del Conlara International Airport","AR",-32.384700775100001,-65.186500549300007]
["Resistencia","Resistencia International Airport","AR",-27.45,-59.056100000000001]
["Puerto Iguazu","Cataratas Del Iguazu International Airport","AR",-25.737300872799999,-54.473400116000001]
["Salta","Martin Miguel De Guemes International Airport","AR",-24.8560009003,-65.486198425300003]
["San Salvador de Jujuy","Gobernador Horacio Guzman International Airport","AR",-24.392799377399999,-65.097801208500002]
["Rio Grande","Hermes Quijada International Airport","AR",-53.777700000000003,-67.749399999999994]
["Mar del Plata","Astor Piazzola International Airport","AR",-37.934199999999997,-57.573300000000003]
["Belem","Val de Cans/Julio Cezar Ribeiro International Airport","BR",-1.3792500496,-48.476299285899998]
["Brasilia","Presidente Juscelino Kubistschek International Airport","BR",-15.8691673279,-47.920833587600001]
["Belo Horizonte","Tancredo Neves International Airport","BR",-19.6244430542,-43.971942901600002]
["Corumba","Corumba International Airport","BR",-19.011943817100001,-57.6713905334]
["Manaus","Eduardo Gomes International Airport","BR",-3.0386099815000001,-60.049701690699997]
["Foz Do Iguacu","Cataratas International Airport","BR",-25.600278854399999,-54.4850006104]
["Florianopolis","Hercilio Luz International Airport","BR",-27.670278549199999,-48.552501678500001]
["Fortaleza","Pinto Martins International Airport","BR",-3.7762799263,-38.5326004028]
["Rio De Janeiro","Galeao - Antonio Carlos Jobim International Airport","BR",-22.809999465899999,-43.2505569458]
["Sao Paulo","Guarulhos - Governador Andre Franco Montoro International Airport","BR",-23.435556411699999,-46.473056793200001]
["Campinas","Viracopos International Airport","BR",-23.007400512699999,-47.134498596199997]
["Navegantes","Ministro Victor Konder International Airport","BR",-26.879999160800001,-48.651401519799997]
["Recife","Guararapes - Gilberto Freyre International Airport","BR",-8.1264896393000008,-34.923599243200002]
["Sao Luis","Marechal Cunha Machado International Airport","BR",-2.5853600501999998,-44.234100341800001]
["Salvador","Deputado Luiz Eduardo Magalhaes International Airport","BR",-12.068355039634,-45.711454410757099]
["Santiago","Comodoro Arturo Merino Benitez International Airport","CL",-33.393001556400002,-70.785797119099996]
["Guayaquil","Simon Bolivar International Airport","EC",-2.1574199200000002,-79.883598327599998]
["Latacunga","Cotopaxi International Airport","EC",-0.90683299299999998,-78.615798950200002]
["Manta","Eloy Alfaro International Airport","EC",-0.94607800249999996,-80.678802490199999]
["Asuncion","Silvio Pettirossi International Airport","PY",-25.239999771099999,-57.520000457800002]
["Ciudad del Este","Guarani International Airport","PY",-25.459999084500001,-54.840000152599998]
["Mariscal Estigarribia","Dr. Luis Maria Argana International Airport","PY",-22.0499992371,-60.6199989319]
["Pedro Juan Caballero","Dr Augusto Roberto Fuster International Airport","PY",-22.6399993896,-55.830001831099999]
["Bogota","El Dorado International Airport","CO",4.7015900000000004,-74.146900000000002]
["Barranquilla","Ernesto Cortissoz International Airport","CO",10.8896,-74.780799999999999]
["Cucuta","Camilo Daza International Airport","CO",7.9275700000000002,-72.511499999999998]
["Cartagena","Rafael Nunez International Airport","CO",10.442399999999999,-75.513000000000005]
["Cali","Alfonso Bonilla Aragon International Airport","CO",3.5432199999999998,-76.381600000000006]
["Leticia","Alfredo Vasquez Cobo International Airport","CO",-4.1935500000000001,-69.943200000000004]
["Pereira","Matecana International Airport","CO",4.8126699999999998,-75.739500000000007]
["Rionegro","Jose Maria Cordova International Airport","CO",6.1645399999999997,-75.423100000000005]
["Santa Marta","Simon Bolivar International Airport","CO",11.1196,-74.230599999999995]
["San Andres","Gustavo Rojas Pinilla International Airport","CO",12.583600000000001,-81.711200000000005]
["Cochabamba","Jorge Wilsterman International Airport","BO",-17.421100616499999,-66.177101135300006]
["La Paz / El Alto","El Alto International Airport","BO",-16.513299942,-68.192298889200003]
["Santa Cruz","Viru Viru International Airport","BO",-17.644800186200001,-63.135398864700001]
["Zandery","Johan Adolf Pengel International Airport","SR",5.4528298378000004,-55.1878013611]
["Pucallpa","Cap FAP David Abenzur Rengifo International Airport","PE",-8.3779401778999993,-74.574302673299997]
["Chiclayo","Capitan FAP Jose A Quinones Gonzales International Airport","PE",-6.7874798775,-79.828102111800007]
["Lima","Jorge Chavez International Airport","PE",-12.021900176999999,-77.1143035889]
["Juliaca","Inca Manco Capac International Airport","PE",-15.4671001434,-70.158203125]
["Iquitos","Coronel FAP Francisco Secada Vignetta International Airport","PE",-3.7847399712000001,-73.308799743700007]
["Arequipa","Rodriguez Ballon International Airport","PE",-16.3411006927,-71.583099365199999]
["Trujillo","Capitan FAP Carlos Martinez De Pinillos International Airport","PE",-8.081410408,-79.108802795399995]
["Pisco","Capitan FAP Renan Elias Olivera International Airport","PE",-13.7448997498,-76.220298767100005]
["Tacna","Coronel FAP Carlos Ciriani Santa Rosa International Airport","PE",-18.053300857499998,-70.275802612299998]
["Puerto Maldonado","Padre Aldamiz International Airport","PE",-12.613599777199999,-69.228599548299997]
["Piura","Capitan FAP Guillermo Concha Iberico International Airport","PE",-5.2057499886,-80.616401672400002]
["Cusco","Alejandro Velasco Astete International Airport","PE",-13.5356998444,-71.938796997099999]
["Artigas","Artigas International Airport","UY",-30.400699615499999,-56.507900237999998]
["Colonia","Laguna de Los Patos International Airport","UY",-34.456401825,-57.770599365199999]
["Durazno","Santa Bernardina International Airport","UY",-33.358898162800003,-56.499198913599997]
["Punta del Este","Capitan Corbeta CA Curbelo International Airport","UY",-34.855098724400001,-55.094299316399997]
["Melo","Cerro Largo International Airport","UY",-32.337898254400002,-54.2167015076]
["Montevideo","Carrasco International /General C L Berisso Airport","UY",-34.838401794399999,-56.030799865699997]
["Rivera","Presidente General Don Oscar D. Gestido International Airport","UY",-30.974599838300001,-55.476200103799997]
["Salto","Nueva Hesperides International Airport","UY",-31.4384994507,-57.985298156699997]
["Barcelona","General Jose Antonio Anzoategui International Airport","VE",10.1070995331,-64.689201354999994]
["Barquisimeto","Barquisimeto International Airport","VE",10.0427465439,-69.358619689899996]
["Paraguana","Josefa Camejo International Airport","VE",11.780775070200001,-70.151496887199997]
["Maracaibo","La Chinita International Airport","VE",10.5582084656,-71.727859497099999]
["Isla Margarita","Del Caribe Santiago Marino International Airport","VE",10.9126033783,-63.966598510700003]
["Puerto Ordaz-Ciudad Guayana","General Manuel Carlos Piar International Airport","VE",8.2885303497000002,-62.760398864700001]
["Santo Domingo","Mayor Buenaventura Vivas International Airport","VE",7.5653800964000002,-72.035102844199997]
["Valencia","Arturo Michelena International Airport","VE",10.149732589699999,-67.928398132300003]
["Georgetown","Cheddi Jagan International Airport","GY",6.4985499382,-58.254100799600003]
["St. George","V.C. Bird International Airport","AG",17.136700000000001,-61.792701999999998]
["Bridgetown","Sir Grantley Adams International Airport","BB",13.074600219700001,-59.492500305199997]
["Fort-de-France","Martinique Aime Cesaire International Airport","MQ",14.5909996033,-61.003200530999997]
["Saint George's","Point Salines International Airport","GD",12.004199981699999,-61.786201477100001]
["San Juan","Luis Munoz Marin International Airport","PR",18.439399719200001,-66.001800537099996]
["Basseterre","Robert L. Bradshaw International Airport","KN",17.3111991882,-62.718700408899998]
["Charlestown","Vance W. Amory International Airport","KN",17.205699920699999,-62.589900970499997]
["Vieux Fort","Hewanorra International Airport","LC",13.7332,-60.952598999999999]
["Oranjestad","Queen Beatrix International Airport","AW",12.5013999939,-70.015197753899997]
["Kralendijk","Flamingo International Airport","BQ",12.1309995651,-68.268501281699997]
["Willemstad","Hato International Airport","CW",12.1888999939,-68.959800720199993]
["Saint Martin","Princess Juliana International Airport","SX",18.041000366199999,-63.108898162800003]
["Port of Spain","Piarco International Airport","TT",10.5953998566,-61.337200164800002]
["Road Town","Terrance B. Lettsome International Airport","VG",18.444799423199999,-64.542999267599996]
["Union Island","Union Island International Airport","VC",12.6001348495,-61.411945342999999]
["Hamilton","L.F. Wade International International Airport","BM",32.363998413099999,-64.678703308099998]
["Astana","Astana International Airport","KZ",51.022201538099999,71.466903686500004]
["Turkistan","Hazrat Sultan International Airport","KZ",43.276901245099999,68.190399169900004]
["Baku","Heydar Aliyev International Airport","AZ",40.467498779300001,50.046699523900003]
["Lankaran","Lankaran International Airport","AZ",38.746398925800001,48.818000793499998]
["Gabala","Gabala International Airport","AZ",40.8266666667,47.712499999999999]
["Zaqatala","Zaqatala International Airport","AZ",41.5622215271,46.667221069299998]
["Zangilan","Zangilan International Airport","AZ",39.094414,46.734098000000003]
["Tamchy","Issyk-Kul International Airport","KG",42.585714000000003,76.701811000000006]
["Bishkek","Manas International Airport","KG",43.061272000000002,74.477508]
["Yerevan","Zvartnots International Airport","AM",40.147300720200001,44.395900726299999]
["Mattanur","Kannur International Airport","IN",11.92,75.55]
["Batumi","Batumi International Airport","GE",41.610298156699997,41.599700927699999]
["Tbilisi","Tbilisi International Airport","GE",41.6692008972,44.954700469999999]
["Vladivostok","Vladivostok International Airport","RU",43.398998260500001,132.14799499509999]
["Kiev","Boryspil International Airport","UA",50.345001220699999,30.894699096699998]
["Donetsk","Donetsk International Airport","UA",48.073600769000002,37.739700317400001]
["Mariupol","Mariupol International Airport","UA",47.0760993958,37.449600219700002]
["Luhansk","Luhansk International Airport","UA",48.417400360099997,39.374099731400001]
["Dnipropetrovsk","Dnipropetrovsk International Airport","UA",48.357200622599997,35.100601196299998]
["Zaporizhia","Zaporizhzhia International Airport","UA",47.867000579799999,35.315700530999997]
["Kryvyi Rih","Kryvyi Rih International Airport","UA",48.043300628700003,33.209999084499998]
["Simferopol","Simferopol International Airport","RU",45.052200317400001,33.9751014709]
["Kharkiv","Kharkiv International Airport","UA",49.924800872799999,36.290000915500002]
["Cherkasy","Cherkasy International Airport","UA",49.415599823000001,31.995300293]
["Kiev","Kiev Zhuliany International Airport","UA",50.401699066200003,30.449699401899998]
["Ivano-Frankivsk","Ivano-Frankivsk International Airport","UA",48.884201049799998,24.686100006099998]
["Lviv","Lviv International Airport","UA",49.8125,23.9561004639]
["Chernivtsi","Chernivtsi International Airport","UA",48.259300231899999,25.980800628699999]
["Rivne","Rivne International Airport","UA",50.607101440400001,26.1415996552]
["Ternopil","Ternopil International Airport","UA",49.5242004395,25.7000999451]
["Uzhhorod","Uzhhorod International Airport","UA",48.634300231899999,22.263399124100001]
["Nikolayev","Mykolaiv International Airport","UA",47.057899475100001,31.919799804699998]
["Odessa","Odessa International Airport","UA",46.426799774199999,30.676500320399999]
["Minsk","Minsk International Airport","BY",53.882499694800003,28.030700683599999]
["Krasnodar","Krasnodar International Airport","RU",45.034698486300002,39.170501709]
["Rostov-on-Don","Platov International Airport","RU",47.500833329999999,39.933611110000001]
["Sochi","Sochi International Airport","RU",43.449901580800002,39.956600189200003]
["Volgograd","Volgograd International Airport","RU",48.782501220699999,44.345500946000001]
["Magnitogorsk","Magnitogorsk International Airport","RU",53.393100738500003,58.755699157700001]
["Kogalym","Kogalym International Airport","RU",62.190399169899997,74.533798217799998]
["Tyumen","Roshchino International Airport","RU",57.189601898200003,65.324302673299997]
["Kerki","Kerki International Airport","TM",37.808889000000001,65.212500000000006]
["Turkmenabat","Turkmenabat International Airport","TM",38.930833,63.563889000000003]
["Kurgan-Tyube","Qurghonteppa International Airport","TJ",37.866401672400002,68.864700317399993]
["Tashkent","Tashkent International Airport","UZ",41.257900237999998,69.281196594199997]
["Moscow","Domodedovo International Airport","RU",55.408798217799998,37.906299591100002]
["Moscow","Sheremetyevo International Airport","RU",55.972599029500003,37.414600372300001]
["Moscow","Ostafyevo International Airport","RU",55.511699676500001,37.507198333700003]
["Belgorod","Belgorod International Airport","RU",50.643798828100003,36.5900993347]
["Voronezh","Voronezh International Airport","RU",51.814201355000002,39.229598998999997]
["Moscow","Vnukovo International Airport","RU",55.591499328600001,37.261501312299998]
["Nizhny Novgorod","Nizhny Novgorod International Airport","RU",56.230098724400001,43.784000396700002]
["Kazan","Kazan International Airport","RU",55.606201171899997,49.278701782200002]
["Ufa","Ufa International Airport","RU",54.5574989319,55.874401092500001]
["Samara","Kurumoch International Airport","RU",53.504901885999999,50.164299011200001]
["Ahmedabad","Sardar Vallabhbhai Patel International Airport","IN",23.077199935900001,72.634696960400007]
["Mumbai","Chhatrapati Shivaji International Airport","IN",19.088699340800002,72.867897033700004]
["Rajkot","Rajkot International Airport","IN",22.381914999999999,71.031681000000006]
["Naqpur","Dr. Babasaheb Ambedkar International Airport","IN",21.092199325599999,79.047203064000001]
["Colombo","Bandaranaike International Colombo Airport","LK",7.1807599067999996,79.884101867699997]
["Weerawila","Weerawila International Airport","LK",6.2544898987000002,81.235198974599996]
["Mattala","Mattala Rajapaksa International Airport","LK",6.2888890000000002,81.123610999999997]
["Phnom Penh","Techo International Airport","KH",11.362916999999999,104.916611]
["Phnom Penh","Phnom Penh International Airport","KH",11.5466003418,104.84400177000001]
["Siem Reap","Siem Reap–Angkor International Airport","KH",13.375278,104.220833]
["Siem Reap","Angkor International Airport","KH",13.4106998444,103.81300354]
["Sihanukville","Sihanoukville International Airport","KH",10.579700470000001,103.63700103799999]
["Kolkata","Netaji Subhash Chandra Bose International Airport","IN",22.654699325599999,88.446701049799998]
["Guwahati","Lokpriya Gopinath Bordoloi International Airport","IN",26.106100082400001,91.585899353000002]
["Kushinagar","Kushinagar International Airport","IN",26.77,83.908056000000002]
["Chittagong","Shah Amanat International Airport","BD",22.249599456799999,91.813301086400003]
["Dhaka","Dhaka / Hazrat Shahjalal International Airport","BD",23.843347000000001,90.397783000000004]
["Sylhet","Osmany International Airport","BD",24.963199615499999,91.866798400899995]
["Hong Kong","Chek Lap Kok International Airport","HK",22.308900833100001,113.915000916]
["Amritsar","Sri Guru Ram Dass Jee International Airport Amritsar","IN",31.7096004486,74.797302246100003]
["New Delhi","Indira Gandhi International Airport","IN",28.5664997101,77.103103637700002]
["Jaipur","Jaipur International Airport","IN",26.824199676500001,75.812202453599994]
["Lucknow","Chaudhary Charan Singh International Airport","IN",26.7605991364,80.889297485399993]
["Noida","Noida International Airport","IN",28.17,77.61]
["Luang Phabang","Luang Phabang International Airport","LA",19.897300720200001,102.1610031128]
["Pakse","Pakse International Airport","LA",15.132100105299999,105.78099822999999]
["Vientiane","Wattay International Airport","LA",17.988300323499999,102.56300354]
["Taipa","Macau International Airport","MO",22.149599075299999,113.59200286870001]
["Kathmandu","Tribhuvan International Airport","NP",27.696599960299999,85.359100341800001]
["Pokhara","Pokhara International Airport","NP",28.1845065592995,84.013248901776706]
["Bangalore","Bengaluru International Airport","IN",13.1978998184,77.706298828100003]
["Coimbatore","Coimbatore International Airport","IN",11.029999733,77.043403625500005]
["Cochin","Cochin International Airport","IN",10.152000427200001,76.401901245100007]
["Calicut","Calicut International Airport","IN",11.1367998123,75.955299377399996]
["Mopa","Manohar International Airport","IN",15.732200000000001,73.867999999999995]
["Hyderabad","Rajiv Gandhi International Airport Shamshabad","IN",17.231317520099999,78.429855346699995]
["Mangalore","Mangalore International Airport","IN",12.9612998962,74.890098571799996]
["Chennai","Chennai International Airport","IN",12.9900054932,80.169296264600007]
["Port Blair","Vir Savarkar International Airport","IN",11.6412000656,92.729698181200007]
["Trivandrum","Trivandrum International Airport","IN",8.4821195601999992,76.920097351099997]
["Maafaru","Maafaru International Airport","MV",5.822222,73.474722]
["Gan","Gan International Airport","MV",-0.69334197040000001,73.155601501500001]
["Male","Male International Airport","MV",4.1918301582000002,73.529098510699995]
["Bangkok","Don Mueang International Airport","TH",13.912599563600001,100.6070022583]
["Rayong","U-Tapao International Airport","TH",12.6799001694,101.00499725340001]
["Chiang Mai","Chiang Mai International Airport","TH",18.766799926800001,98.962600707999997]
["Chiang Rai","Chiang Rai International Airport","TH",19.952299117999999,99.882896423299997]
["Phuket","Phuket International Airport","TH",8.1132001877000004,98.316902160599994]
["Hat Yai","Hat Yai International Airport","TH",6.9332098961000002,100.39299774200001]
["Dung Quat Bay","Chu Lai International Airport","VN",15.4033002853,108.706001282]
["Haiphong","Cat Bi International Airport","VN",20.819400787399999,106.7249984741]
["Da Nang","Da Nang International Airport","VN",16.0438995361,108.1989974976]
["Hanoi","Noi Bai International Airport","VN",21.221200942999999,105.8069992065]
["Ho Chi Minh City","Tan Son Nhat International Airport","VN",10.818799972500001,106.652000427]
["Vân Đồn","Van Don International Airport","VN",21.117778000000001,107.41416700000001]
["Mandalay","Mandalay International Airport","MM",21.702199935900001,95.977897643999995]
["Yangon","Yangon International Airport","MM",16.907300949100001,96.133201599100005]
["Ujung Pandang-Celebes Island","Hasanuddin International Airport","ID",-5.0616297721999999,119.5540008545]
["Denpasar-Bali Island","Ngurah Rai (Bali) International Airport","ID",-8.7481698990000005,115.1669998169]
["Mataram","Bandara International Lombok Airport","ID",-8.7573220000000003,116.276675]
["Yogyakarta","Yogyakarta International Airport","ID",-7.9074590000000002,110.05448]
["Balikpapan-Borneo Island","Sepinggan International Airport","ID",-1.2682700157,116.89399719239999]
["Samarinda","Aji Pangeran Tumenggung Pranoto International Airport","ID",-0.37361100000000003,117.255556]
["Yogyakarta-Java Island","Adi Sutjipto International Airport","ID",-7.7881798743999999,110.4319992065]
["Surabaya","Juanda International Airport","ID",-7.3798298836000003,112.7870025635]
["Kuching","Kuching International Airport","MY",1.4846999645000001,110.3470001221]
["Kota Kinabalu","Kota Kinabalu International Airport","MY",5.9372100830000001,116.0510025024]
["Bandar Seri Begawan","Brunei International Airport","BN",4.9442000389,114.9280014038]
["Kertajati","Majalengka Kertajati International Airport","ID",-6.6476863354557096,108.165802638643]
["Bandung-Java Island","Husein Sastranegara International Airport","ID",-6.9006299973000003,107.5759963989]
["Jakarta","Soekarno-Hatta International Airport","ID",-6.1255698204,106.65599822999999]
["Medan-Sumatra Island","Polonia International Airport","ID",3.5580599307999998,98.671699523900003]
["Siborong-Borong","Sisingamangaraja XII International Airport","ID",2.259722,98.995277999999999]
["Senai","Senai International Airport","MY",1.6413099766000001,103.66999816889999]
["Kuala Lumpur","Kuala Lumpur International Airport","MY",2.745579958,101.7099990845]
["Langkawi","Langkawi International Airport","MY",6.3297300338999998,99.7286987305]
["Penang","Penang International Airport","MY",5.2971401215,100.27700042719999]
["Subang","Sultan Abdul Aziz Shah International Airport","MY",3.1305799483999999,101.5490036011]
["Dili","Presidente Nicolau Lobato International Airport","TL",-8.5464000702000007,125.526000977]
["Singapore","Singapore Changi International Airport","SG",1.3501900434,103.9940032959]
["Brisbane","Brisbane International Airport","AU",-27.384199142500002,153.11700439449999]
["Cairns","Cairns International Airport","AU",-16.885799408,145.755004883]
["Broome","Broome International Airport","AU",-17.944700241100001,122.2320022583]
["Hobart","Hobart International Airport","AU",-42.836101532000001,147.50999450699999]
["Melbourne","Melbourne International Airport","AU",-37.673301696800003,144.84300231930001]
["Adelaide","Adelaide International Airport","AU",-34.944999694800003,138.53100585940001]
["Darwin","Darwin International Airport","AU",-12.4146995544,130.87699890139999]
["Port Hedland","Port Hedland International Airport","AU",-20.3777999878,118.625999451]
["Perth","Perth International Airport","AU",-31.9402999878,115.96700286870001]
["Canberra","Canberra International Airport","AU",-35.306900024400001,149.19500732419999]
["Burnt Pine","Norfolk Island International Airport","NF",-29.041599273700001,167.93899536129999]
["Sydney","Sydney Kingsford Smith International Airport","AU",-33.946098327599998,151.17700195309999]
["Beijing","Beijing Capital International Airport","CN",40.0801010132,116.5849990845]
["Beijing","Beijing Daxing International Airport","CN",39.509166999999998,116.410556]
["Erenhot","Erenhot Saiwusu International Airport","CN",43.422499999999999,112.09666666699999]
["Hohhot","Baita International Airport","CN",40.851398467999999,111.823997498]
["Shijiazhuang","Shijiazhuang Daguocun International Airport","CN",38.280700683600003,114.6969985962]
["Tianjin","Tianjin Binhai International Airport","CN",39.124401092500001,117.346000671]
["Guangzhou","Guangzhou Baiyun International Airport","CN",23.392400741599999,113.2990036011]
["Guilin City","Guilin Liangjiang International Airport","CN",25.2180995941,110.03900146479999]
["Shenzhen","Shenzhen Bao'an International Airport","CN",22.6392993927,113.8109970093]
["Wuhan","Wuhan Tianhe International Airport","CN",30.783800125100001,114.2080001831]
["Haikou","Haikou Meilan International Airport","CN",19.934900283800001,110.4589996338]
["Sanya","Sanya Phoenix International Airport","CN",18.3029003143,109.4120025635]
["Pyongyang","Sunan International Airport","KP",39.224098205600001,125.66999816889999]
["Xianyang","Xi'an Xianyang International Airport","CN",34.447101592999999,108.7519989014]
["Ulaanbaatar","Chinggis Khaan International Airport","MN",47.651581,106.821772]
["Ulan Bator","Chinggis Khaan International Airport","MN",47.843101501500001,106.76699829099999]
["Kunming","Kunming Wujiaba International Airport","CN",24.992399215700001,102.7440032959]
["Xiamen","Xiamen Gaoqi International Airport","CN",24.544000625599999,118.12799835209999]
["Nanchang","Nanchang Changbei International Airport","CN",28.864999771099999,115.9000015259]
["Fuzhou","Fuzhou Changle International Airport","CN",25.935100555399998,119.6630020142]
["Hangzhou","Hangzhou Xiaoshan International Airport","CN",30.229499816899999,120.4339981079]
["Ningbo","Ningbo Lishe International Airport","CN",29.826700210599999,121.4619979858]
["Hefei","Hefei Xinqiao International Airport","CN",31.988980000000002,116.96380000000001]
["Shanghai","Shanghai Pudong International Airport","CN",31.1434001923,121.8050003052]
["Qingdao","Qingdao Jiaodong International Airport","CN",36.361944000000001,120.08833300000001]
["Shanghai","Shanghai Hongqiao International Airport","CN",31.197900772099999,121.33599853520001]
["Huangshan","Tunxi International Airport","CN",29.733299255399999,118.2559967041]
["Wuxi","Sunan Shuofang International Airport","CN",31.494400024400001,120.42900085399999]
["Chongqing","Chongqing Jiangbei International Airport","CN",29.719200134299999,106.64199829099999]
["Chengdu","Chengdu Tianfu International Airport","CN",30.318999999999999,104.44499999999999]
["Chengdu","Chengdu Shuangliu International Airport","CN",30.578500747700001,103.9469985962]
["Urumqi","Urumqi Diwopu International Airport","CN",43.907100677499997,87.474197387700002]
["Mudanjiang","Mudanjiang Hailang International Airport","CN",44.524101257300003,129.56900024399999]
["Belgrade","Belgrade Nikola Tesla Airport","RS",44.818401336699999,20.309099197399998]